[Builder] [Build Report] Carbon 2.0.3 Release - WSS4J - continuous build 43 has FAILED (1 tests failed)

WSO2 Builder bamboo at builder.wso2.org
Wed Dec 23 01:12:19 PST 2009


-------------- next part --------------
-----------------------------------------------------------
CBNCONTIN-CBNWSS4J-43 failed.
-----------------------------------------------------------
This build occured because it is a dependant of CBNCONTIN-AXIS2TRANSP-50.
1/116 tests failed.

http://builder.wso2.org/browse/CBNCONTIN-CBNWSS4J-43/        


--------------
Tests
--------------
Failed Tests (1)
   - TestWSSecurityUTDK: Derived key changed signature (New)


--------------
Error Summary
--------------
   [INFO] ------------------------------------------------------------------------
   [ERROR] BUILD FAILURE
   [INFO] ------------------------------------------------------------------------
   [INFO] There are test failures.
   
   Please refer to /mnt/var/builder/bamboo_home_2.0_beta5/xml-data/build-dir/CBNCONTIN-CBNWSS4J/target/surefire-reports for the individual test results.
   [INFO] ------------------------------------------------------------------------
   [INFO] For more information, run Maven with the -e switch


--
This message is automatically generated by Atlassian Bamboo

-------------- next part --------------
An HTML attachment was scrubbed...
URL: http://wso2.org/pipermail/builder/attachments/20091223/e59ff9dc/attachment-0001.htm 


More information about the Builder mailing list