[Builder] Build failed in Jenkins: analytics-products » analytics-http #512

cbuilder at wso2.org cbuilder at wso2.org
Thu Nov 30 12:34:20 PST 2017


See <https://wso2.org/jenkins/job/analytics-products/job/analytics-http/512/display/redirect>

------------------------------------------
[...truncated 1.54 MB...]
	at org.apache.maven.surefire.booter.ForkedBooter.invokeProviderInSameClassLoader(ForkedBooter.java:203)
	at org.apache.maven.surefire.booter.ForkedBooter.runSuitesInProcess(ForkedBooter.java:155)
	at org.apache.maven.surefire.booter.ForkedBooter.main(ForkedBooter.java:103)
ERROR [org.wso2.carbon.automation.engine.testlisteners.TestExecutionListener] - Execution error occurred in TestExecutionListener:-
java.lang.reflect.InvocationTargetException
	at sun.reflect.NativeMethodAccessorImpl.invoke0(Native Method)
	at sun.reflect.NativeMethodAccessorImpl.invoke(NativeMethodAccessorImpl.java:62)
	at sun.reflect.DelegatingMethodAccessorImpl.invoke(DelegatingMethodAccessorImpl.java:43)
	at java.lang.reflect.Method.invoke(Method.java:497)
	at org.wso2.carbon.automation.engine.extensions.TestNGExtensionExecutor.executeExtensible(TestNGExtensionExecutor.java:75)
	at org.wso2.carbon.automation.engine.testlisteners.TestExecutionListener.onExecutionFinish(TestExecutionListener.java:62)
	at org.testng.TestNG.runExecutionListeners(TestNG.java:1033)
	at org.testng.TestNG.run(TestNG.java:1013)
	at org.apache.maven.surefire.testng.TestNGExecutor.run(TestNGExecutor.java:295)
	at org.apache.maven.surefire.testng.TestNGXmlTestSuite.execute(TestNGXmlTestSuite.java:84)
	at org.apache.maven.surefire.testng.TestNGProvider.invoke(TestNGProvider.java:90)
	at org.apache.maven.surefire.booter.ForkedBooter.invokeProviderInSameClassLoader(ForkedBooter.java:203)
	at org.apache.maven.surefire.booter.ForkedBooter.runSuitesInProcess(ForkedBooter.java:155)
	at org.apache.maven.surefire.booter.ForkedBooter.main(ForkedBooter.java:103)
Caused by: org.wso2.carbon.automation.engine.exceptions.AutomationFrameworkException: Error while deleting users 
	at org.wso2.carbon.integration.common.extensions.usermgt.UserPopulateExtension.onExecutionFinish(UserPopulateExtension.java:88)
	... 14 more
Caused by: org.wso2.carbon.integration.common.extensions.exceptions.AutomationExtensionException: Error while deleting users 
	at org.wso2.carbon.integration.common.extensions.usermgt.UserPopulator.deleteUsers(UserPopulator.java:258)
	at org.wso2.carbon.integration.common.extensions.usermgt.UserPopulateExtension.onExecutionFinish(UserPopulateExtension.java:86)
	... 14 more
Caused by: org.apache.axis2.AxisFault: Connection refused
	at org.apache.axis2.AxisFault.makeFault(AxisFault.java:430)
	at org.apache.axis2.transport.http.HTTPSender.sendViaPost(HTTPSender.java:199)
	at org.apache.axis2.transport.http.HTTPSender.send(HTTPSender.java:77)
	at org.apache.axis2.transport.http.CommonsHTTPTransportSender.writeMessageWithCommons(CommonsHTTPTransportSender.java:451)
	at org.apache.axis2.transport.http.CommonsHTTPTransportSender.invoke(CommonsHTTPTransportSender.java:278)
	at org.apache.axis2.engine.AxisEngine.send(AxisEngine.java:442)
	at org.apache.axis2.description.OutInAxisOperationClient.send(OutInAxisOperation.java:430)
	at org.apache.axis2.description.OutInAxisOperationClient.executeImpl(OutInAxisOperation.java:225)
	at org.apache.axis2.client.OperationClient.execute(OperationClient.java:149)
	at org.wso2.carbon.authenticator.stub.AuthenticationAdminStub.login(AuthenticationAdminStub.java:659)
	at org.wso2.carbon.integration.common.admin.client.AuthenticatorClient.login(AuthenticatorClient.java:59)
	at org.wso2.carbon.integration.common.extensions.usermgt.UserPopulator.login(UserPopulator.java:296)
	at org.wso2.carbon.integration.common.extensions.usermgt.UserPopulator.deleteUsers(UserPopulator.java:229)
	... 15 more
Caused by: java.net.ConnectException: Connection refused
	at java.net.PlainSocketImpl.socketConnect(Native Method)
	at java.net.AbstractPlainSocketImpl.doConnect(AbstractPlainSocketImpl.java:345)
	at java.net.AbstractPlainSocketImpl.connectToAddress(AbstractPlainSocketImpl.java:206)
	at java.net.AbstractPlainSocketImpl.connect(AbstractPlainSocketImpl.java:188)
	at java.net.SocksSocketImpl.connect(SocksSocketImpl.java:392)
	at java.net.Socket.connect(Socket.java:589)
	at sun.security.ssl.SSLSocketImpl.connect(SSLSocketImpl.java:656)
	at sun.reflect.GeneratedMethodAccessor5.invoke(Unknown Source)
	at sun.reflect.DelegatingMethodAccessorImpl.invoke(DelegatingMethodAccessorImpl.java:43)
	at java.lang.reflect.Method.invoke(Method.java:497)
	at org.apache.commons.httpclient.protocol.ReflectionSocketFactory.createSocket(ReflectionSocketFactory.java:140)
	at org.apache.commons.httpclient.protocol.SSLProtocolSocketFactory.createSocket(SSLProtocolSocketFactory.java:162)
	at org.apache.commons.httpclient.HttpConnection.open(HttpConnection.java:707)
	at org.apache.commons.httpclient.MultiThreadedHttpConnectionManager$HttpConnectionAdapter.open(MultiThreadedHttpConnectionManager.java:1361)
	at org.apache.commons.httpclient.HttpMethodDirector.executeWithRetry(HttpMethodDirector.java:387)
	at org.apache.commons.httpclient.HttpMethodDirector.executeMethod(HttpMethodDirector.java:171)
	at org.apache.commons.httpclient.HttpClient.executeMethod(HttpClient.java:397)
	at org.apache.axis2.transport.http.AbstractHTTPSender.executeMethod(AbstractHTTPSender.java:630)
	at org.apache.axis2.transport.http.HTTPSender.sendViaPost(HTTPSender.java:195)
	... 26 more
INFO  [org.wso2.carbon.automation.extensions.servers.carbonserver.CarbonServerManager] - Shutting down server..
INFO  [org.wso2.carbon.automation.extensions.servers.utils.ClientConnectionUtil] - Port 11943 is closed and available for use
INFO  [org.wso2.carbon.automation.extensions.servers.carbonserver.CarbonServerManager] - Generating Jacoco code coverage...
INFO  [org.wso2.carbon.automation.engine.frameworkutils.CodeCoverageUtils] - Loading execution data file <https://wso2.org/jenkins/job/analytics-products/job/analytics-http/ws/product/integration/tests-integration/target/jacoco/jacoco1512073162902.exec>
INFO  [org.wso2.carbon.automation.engine.frameworkutils.CodeCoverageUtils] - Loading execution data file <https://wso2.org/jenkins/job/analytics-products/job/analytics-http/ws/product/integration/tests-integration/target/jacoco/jacoco1512073044576.exec>
INFO  [org.wso2.carbon.automation.engine.frameworkutils.CodeCoverageUtils] - Writing merged execution data to <https://wso2.org/jenkins/job/analytics-products/job/analytics-http/ws/product/integration/tests-integration/target/jacoco/jacoco-data-merge.exec>
INFO  [org.wso2.carbon.automation.engine.frameworkutils.CodeCoverageUtils] - Building jar list for Jacoco coverage exclusion...
INFO  [org.wso2.carbon.automation.engine.frameworkutils.CodeCoverageUtils] - Building jar list for Jacoco coverage inclusion...
INFO  [org.wso2.carbon.automation.engine.frameworkutils.ReportGenerator] - Jar file analyzed for coverage : org.wso2.carbon.analytics.servlet_1.1.0.jar
INFO  [org.wso2.carbon.automation.engine.frameworkutils.ReportGenerator] - Jar file analyzed for coverage : org.wso2.carbon.analytics.datasource.cassandra_1.1.0.jar
INFO  [org.wso2.carbon.automation.engine.frameworkutils.ReportGenerator] - Jar file analyzed for coverage : org.wso2.carbon.analytics.datasource.commons_1.1.0.jar
INFO  [org.wso2.carbon.automation.engine.frameworkutils.ReportGenerator] - Jar file analyzed for coverage : org.wso2.carbon.analytics.stream.persistence_1.1.0.jar
INFO  [org.wso2.carbon.automation.engine.frameworkutils.ReportGenerator] - Jar file analyzed for coverage : org.wso2.carbon.analytics.spark.utils_1.1.0.jar
INFO  [org.wso2.carbon.automation.engine.frameworkutils.ReportGenerator] - Jar file analyzed for coverage : org.wso2.carbon.analytics.eventsink_1.1.0.jar
INFO  [org.wso2.carbon.automation.engine.frameworkutils.ReportGenerator] - Jar file analyzed for coverage : org.wso2.carbon.analytics.activitydashboard.commons_1.1.0.jar
INFO  [org.wso2.carbon.automation.engine.frameworkutils.ReportGenerator] - Jar file analyzed for coverage : org.wso2.carbon.analytics.datasource.core_1.1.0.jar
INFO  [org.wso2.carbon.automation.engine.frameworkutils.ReportGenerator] - Jar file analyzed for coverage : org.wso2.carbon.analytics.activitydashboard.admin_1.1.0.jar
INFO  [org.wso2.carbon.automation.engine.frameworkutils.ReportGenerator] - Jar file analyzed for coverage : org.wso2.carbon.analytics.datasource.hbase_1.1.0.jar
INFO  [org.wso2.carbon.automation.engine.frameworkutils.ReportGenerator] - Jar file analyzed for coverage : org.wso2.carbon.analytics.spark.admin_1.1.0.jar
INFO  [org.wso2.carbon.automation.engine.frameworkutils.ReportGenerator] - Jar file analyzed for coverage : org.wso2.carbon.analytics.webservice_1.1.0.jar
INFO  [org.wso2.carbon.automation.engine.frameworkutils.ReportGenerator] - Jar file analyzed for coverage : org.wso2.carbon.analytics.io.commons_1.1.0.jar
INFO  [org.wso2.carbon.automation.engine.frameworkutils.ReportGenerator] - Jar file analyzed for coverage : org.wso2.carbon.analytics.dataservice.core_1.1.0.jar
INFO  [org.wso2.carbon.automation.engine.frameworkutils.ReportGenerator] - Jar file analyzed for coverage : org.wso2.carbon.analytics.api_1.1.0.jar
INFO  [org.wso2.carbon.automation.engine.frameworkutils.ReportGenerator] - Jar file analyzed for coverage : org.wso2.carbon.analytics.datasource.rdbms_1.1.0.jar
INFO  [org.wso2.carbon.automation.engine.frameworkutils.ReportGenerator] - Jar file analyzed for coverage : org.wso2.carbon.analytics.messageconsole_1.1.0.jar
INFO  [org.wso2.carbon.automation.extensions.servers.carbonserver.CarbonServerManager] - Jacoco coverage dump file path : <https://wso2.org/jenkins/job/analytics-products/job/analytics-http/ws/product/integration/tests-integration/target/jacoco/jacoco1512073920649.exec>
INFO  [org.wso2.carbon.automation.extensions.servers.carbonserver.CarbonServerManager] - Jacoco class file path : <https://wso2.org/jenkins/job/analytics-products/job/analytics-http/ws/product/integration/tests-integration/target/carbontmp1512073040238/wso2http-analytics-1.0.0-SNAPSHOT/repository/components/plugins>
INFO  [org.wso2.carbon.automation.extensions.servers.carbonserver.CarbonServerManager] - Jacoco coverage HTML report path : <https://wso2.org/jenkins/job/analytics-products/job/analytics-http/ws/product/integration/tests-integration/target/jacoco/coverage/index.html>

Results :

Tests run: 0, Failures: 0, Errors: 0, Skipped: 0

[JENKINS] Recording test results
[BFA] Scanning build for known causes...
[BFA] No failure causes found
[BFA] Done. 0s
[INFO] ------------------------------------------------------------------------
[INFO] Reactor Summary:
[INFO] 
[INFO] Analytics HTTP - Aggregator POM ................... SUCCESS [10.634s]
[INFO] Analytics HTTP Components - Aggregator POM ........ SUCCESS [11.839s]
[INFO] Analytics HTTP Component .......................... SUCCESS [11:17.827s]
[INFO] Analytics HTTP Features - Aggregator POM .......... SUCCESS [0.224s]
[INFO] Analytics HTTP Feature ............................ SUCCESS [9.470s]
[INFO] WSO2 HTTP Analytics Server - Multi-tenant Dashboard  SUCCESS [42.122s]
[INFO] WSO2 HTTP Analytics Server - Styles Parent ........ SUCCESS [0.055s]
[INFO] WSO2 HTTP Analytics Server - Product UI Styles .... SUCCESS [30.236s]
[INFO] WSO2 HTTP Analytics Server - Multi-tenant UI Styles  SUCCESS [6.783s]
[INFO] WSO2 HTTP Analytics Server - Features Parent ...... SUCCESS [0.415s]
[INFO] WSO2 HTTP Analytics Server - Features ............. SUCCESS [0.397s]
[INFO] WSO2 HTTP Analytics Server - Product Style Feature  SUCCESS [2.536s]
[INFO] WSO2 HTTP Analytics Server - Multi-tenant-Features  SUCCESS [0.311s]
[INFO] WSO2 HTTP Analytics Server - Multi-tenant Style Feature  SUCCESS [1.097s]
[INFO] WSO2 HTTP Analytics Server - Multi-tenant Dashboard Feature  SUCCESS [33.686s]
[INFO] WSO2 HTTP Analytics Server - P2 Profile Generation  SUCCESS [2:55.275s]
[INFO] WSO2 HTTP Analytics Server - Distribution ......... SUCCESS [24.734s]
[INFO] WSO2 HTTP Analytics Server - Integration Tests .... SUCCESS [0.648s]
[INFO] WSO2 HTTP Analytics Server - Integration Test Common Utils Module  SUCCESS [3:44.617s]
[INFO] WSO2 HTTP Analytics Server - Integration Test Common Module  SUCCESS [29.278s]
[INFO] WSO2 HTTP Analytics Server - Integration Test UI Pages  SUCCESS [14.434s]
[INFO] WSO2 HTTP Analytics Server - Integration Test Module  FAILURE [20:15.970s]
[INFO] WSO2 HTTP Analytics Server - Integration UI ....... SKIPPED
[INFO] WSO2 HTTP Analytics Server - Integration Test UI .. SKIPPED
[INFO] ------------------------------------------------------------------------
[INFO] BUILD FAILURE
[INFO] ------------------------------------------------------------------------
[INFO] Total time: 42:16.173s
[INFO] Finished at: Thu Nov 30 20:32:04 UTC 2017
[INFO] Final Memory: 105M/780M
[INFO] ------------------------------------------------------------------------
Waiting for Jenkins to finish collecting data
[ERROR] Failed to execute goal org.apache.maven.plugins:maven-surefire-plugin:2.18.1:test (default-test) on project org.wso2.das4http.integration.tests: Execution default-test of goal org.apache.maven.plugins:maven-surefire-plugin:2.18.1:test failed: There was an error in the forked process
[ERROR] java.lang.RuntimeException: Error while tear down the execution environment
[ERROR] at org.wso2.carbon.automation.engine.testlisteners.TestExecutionListener.handleException(TestExecutionListener.java:71)
[ERROR] at org.wso2.carbon.automation.engine.testlisteners.TestExecutionListener.onExecutionFinish(TestExecutionListener.java:65)
[ERROR] at org.testng.TestNG.runExecutionListeners(TestNG.java:1033)
[ERROR] at org.testng.TestNG.run(TestNG.java:1013)
[ERROR] at org.apache.maven.surefire.testng.TestNGExecutor.run(TestNGExecutor.java:295)
[ERROR] at org.apache.maven.surefire.testng.TestNGXmlTestSuite.execute(TestNGXmlTestSuite.java:84)
[ERROR] at org.apache.maven.surefire.testng.TestNGProvider.invoke(TestNGProvider.java:90)
[ERROR] at org.apache.maven.surefire.booter.ForkedBooter.invokeProviderInSameClassLoader(ForkedBooter.java:203)
[ERROR] at org.apache.maven.surefire.booter.ForkedBooter.runSuitesInProcess(ForkedBooter.java:155)
[ERROR] at org.apache.maven.surefire.booter.ForkedBooter.main(ForkedBooter.java:103)
[ERROR] Caused by: java.lang.reflect.InvocationTargetException
[ERROR] at sun.reflect.NativeMethodAccessorImpl.invoke0(Native Method)
[ERROR] at sun.reflect.NativeMethodAccessorImpl.invoke(NativeMethodAccessorImpl.java:62)
[ERROR] at sun.reflect.DelegatingMethodAccessorImpl.invoke(DelegatingMethodAccessorImpl.java:43)
[ERROR] at java.lang.reflect.Method.invoke(Method.java:497)
[ERROR] at org.wso2.carbon.automation.engine.extensions.TestNGExtensionExecutor.executeExtensible(TestNGExtensionExecutor.java:75)
[ERROR] at org.wso2.carbon.automation.engine.testlisteners.TestExecutionListener.onExecutionFinish(TestExecutionListener.java:62)
[ERROR] ... 8 more
[ERROR] Caused by: org.wso2.carbon.automation.engine.exceptions.AutomationFrameworkException: Error while deleting users
[ERROR] at org.wso2.carbon.integration.common.extensions.usermgt.UserPopulateExtension.onExecutionFinish(UserPopulateExtension.java:88)
[ERROR] ... 14 more
[ERROR] Caused by: org.wso2.carbon.integration.common.extensions.exceptions.AutomationExtensionException: Error while deleting users
[ERROR] at org.wso2.carbon.integration.common.extensions.usermgt.UserPopulator.deleteUsers(UserPopulator.java:258)
[ERROR] at org.wso2.carbon.integration.common.extensions.usermgt.UserPopulateExtension.onExecutionFinish(UserPopulateExtension.java:86)
[ERROR] ... 14 more
[ERROR] Caused by: org.apache.axis2.AxisFault: Connection refused
[ERROR] at org.apache.axis2.AxisFault.makeFault(AxisFault.java:430)
[ERROR] at org.apache.axis2.transport.http.HTTPSender.sendViaPost(HTTPSender.java:199)
[ERROR] at org.apache.axis2.transport.http.HTTPSender.send(HTTPSender.java:77)
[ERROR] at org.apache.axis2.transport.http.CommonsHTTPTransportSender.writeMessageWithCommons(CommonsHTTPTransportSender.java:451)
[ERROR] at org.apache.axis2.transport.http.CommonsHTTPTransportSender.invoke(CommonsHTTPTransportSender.java:278)
[ERROR] at org.apache.axis2.engine.AxisEngine.send(AxisEngine.java:442)
[ERROR] at org.apache.axis2.description.OutInAxisOperationClient.send(OutInAxisOperation.java:430)
[ERROR] at org.apache.axis2.description.OutInAxisOperationClient.executeImpl(OutInAxisOperation.java:225)
[ERROR] at org.apache.axis2.client.OperationClient.execute(OperationClient.java:149)
[ERROR] at org.wso2.carbon.authenticator.stub.AuthenticationAdminStub.login(AuthenticationAdminStub.java:659)
[ERROR] at org.wso2.carbon.integration.common.admin.client.AuthenticatorClient.login(AuthenticatorClient.java:59)
[ERROR] at org.wso2.carbon.integration.common.extensions.usermgt.UserPopulator.login(UserPopulator.java:296)
[ERROR] at org.wso2.carbon.integration.common.extensions.usermgt.UserPopulator.deleteUsers(UserPopulator.java:229)
[ERROR] ... 15 more
[ERROR] Caused by: java.net.ConnectException: Connection refused
[ERROR] at java.net.PlainSocketImpl.socketConnect(Native Method)
[ERROR] at java.net.AbstractPlainSocketImpl.doConnect(AbstractPlainSocketImpl.java:345)
[ERROR] at java.net.AbstractPlainSocketImpl.connectToAddress(AbstractPlainSocketImpl.java:206)
[ERROR] at java.net.AbstractPlainSocketImpl.connect(AbstractPlainSocketImpl.java:188)
[ERROR] at java.net.SocksSocketImpl.connect(SocksSocketImpl.java:392)
[ERROR] at java.net.Socket.connect(Socket.java:589)
[ERROR] at sun.security.ssl.SSLSocketImpl.connect(SSLSocketImpl.java:656)
[ERROR] at sun.reflect.GeneratedMethodAccessor5.invoke(Unknown Source)
[ERROR] at sun.reflect.DelegatingMethodAccessorImpl.invoke(DelegatingMethodAccessorImpl.java:43)
[ERROR] at java.lang.reflect.Method.invoke(Method.java:497)
[ERROR] at org.apache.commons.httpclient.protocol.ReflectionSocketFactory.createSocket(ReflectionSocketFactory.java:140)
[ERROR] at org.apache.commons.httpclient.protocol.SSLProtocolSocketFactory.createSocket(SSLProtocolSocketFactory.java:162)
[ERROR] at org.apache.commons.httpclient.HttpConnection.open(HttpConnection.java:707)
[ERROR] at org.apache.commons.httpclient.MultiThreadedHttpConnectionManager$HttpConnectionAdapter.open(MultiThreadedHttpConnectionManager.java:1361)
[ERROR] at org.apache.commons.httpclient.HttpMethodDirector.executeWithRetry(HttpMethodDirector.java:387)
[ERROR] at org.apache.commons.httpclient.HttpMethodDirector.executeMethod(HttpMethodDirector.java:171)
[ERROR] at org.apache.commons.httpclient.HttpClient.executeMethod(HttpClient.java:397)
[ERROR] at org.apache.axis2.transport.http.AbstractHTTPSender.executeMethod(AbstractHTTPSender.java:630)
[ERROR] at org.apache.axis2.transport.http.HTTPSender.sendViaPost(HTTPSender.java:195)
[ERROR] ... 26 more
[ERROR] -> [Help 1]
[ERROR] 
[ERROR] To see the full stack trace of the errors, re-run Maven with the -e switch.
[ERROR] Re-run Maven using the -X switch to enable full debug logging.
[ERROR] 
[ERROR] For more information about the errors and possible solutions, please read the following articles:
[ERROR] [Help 1] http://cwiki.apache.org/confluence/display/MAVEN/PluginExecutionException
[ERROR] 
[ERROR] After correcting the problems, you can resume the build with the command
[ERROR]   mvn <goals> -rf :org.wso2.das4http.integration.tests
[JENKINS] Archiving <https://wso2.org/jenkins/job/analytics-products/job/analytics-http/ws/pom.xml> to org.wso2.analytics.http/wso2analytics-http-parent/1.0.0-SNAPSHOT/wso2analytics-http-parent-1.0.0-SNAPSHOT.pom
[JENKINS] Archiving <https://wso2.org/jenkins/job/analytics-products/job/analytics-http/ws/product/styles/product/pom.xml> to org.wso2.analytics.http/org.wso2.das4http.styles/1.0.0-SNAPSHOT/org.wso2.das4http.styles-1.0.0-SNAPSHOT.pom
[JENKINS] Archiving <https://wso2.org/jenkins/job/analytics-products/job/analytics-http/ws/product/styles/product/target/org.wso2.das4http.styles-1.0.0-SNAPSHOT.jar> to org.wso2.analytics.http/org.wso2.das4http.styles/1.0.0-SNAPSHOT/org.wso2.das4http.styles-1.0.0-SNAPSHOT.jar
[JENKINS] Archiving <https://wso2.org/jenkins/job/analytics-products/job/analytics-http/ws/product/features/product/org.wso2.das4http.styles.feature/target/org.wso2.das4http.styles.feature-1.0.0-SNAPSHOT.zip> to org.wso2.analytics.http/org.wso2.das4http.styles.feature/1.0.0-SNAPSHOT/org.wso2.das4http.styles.feature-1.0.0-SNAPSHOT.pom
[JENKINS] Archiving <https://wso2.org/jenkins/job/analytics-products/job/analytics-http/ws/product/features/product/org.wso2.das4http.styles.feature/target/org.wso2.das4http.styles.feature-1.0.0-SNAPSHOT.zip> to org.wso2.analytics.http/org.wso2.das4http.styles.feature/1.0.0-SNAPSHOT/org.wso2.das4http.styles.feature-1.0.0-SNAPSHOT.zip
[JENKINS] Archiving <https://wso2.org/jenkins/job/analytics-products/job/analytics-http/ws/product/p2-profile-gen/pom.xml> to org.wso2.analytics.http/wso2analytics-http-release-profile-gen/1.0.0-SNAPSHOT/wso2analytics-http-release-profile-gen-1.0.0-SNAPSHOT.pom
[JENKINS] Archiving <https://wso2.org/jenkins/job/analytics-products/job/analytics-http/ws/product/integration/tests-common/integration-test-utils/pom.xml> to org.wso2.analytics.http/org.wso2.das4http.integration.common.utils/1.0.0-SNAPSHOT/org.wso2.das4http.integration.common.utils-1.0.0-SNAPSHOT.pom
[JENKINS] Archiving <https://wso2.org/jenkins/job/analytics-products/job/analytics-http/ws/product/integration/tests-common/integration-test-utils/target/org.wso2.das4http.integration.common.utils-1.0.0-SNAPSHOT.jar> to org.wso2.analytics.http/org.wso2.das4http.integration.common.utils/1.0.0-SNAPSHOT/org.wso2.das4http.integration.common.utils-1.0.0-SNAPSHOT.jar
[JENKINS] Archiving <https://wso2.org/jenkins/job/analytics-products/job/analytics-http/ws/product/org.wso2.das4http.multitenancy.dashboard.ui/pom.xml> to org.wso2.analytics.http/org.wso2.das4http.multitenancy.dashboard.ui/1.0.0-SNAPSHOT/org.wso2.das4http.multitenancy.dashboard.ui-1.0.0-SNAPSHOT.pom
[JENKINS] Archiving <https://wso2.org/jenkins/job/analytics-products/job/analytics-http/ws/product/org.wso2.das4http.multitenancy.dashboard.ui/target/org.wso2.das4http.multitenancy.dashboard.ui-1.0.0-SNAPSHOT.jar> to org.wso2.analytics.http/org.wso2.das4http.multitenancy.dashboard.ui/1.0.0-SNAPSHOT/org.wso2.das4http.multitenancy.dashboard.ui-1.0.0-SNAPSHOT.jar
[JENKINS] Archiving <https://wso2.org/jenkins/job/analytics-products/job/analytics-http/ws/product/integration/pom.xml> to org.wso2.analytics.http/das4http-integration/1.0.0-SNAPSHOT/das4http-integration-1.0.0-SNAPSHOT.pom
[JENKINS] Archiving <https://wso2.org/jenkins/job/analytics-products/job/analytics-http/ws/product/integration/tests-common/ui-pages/pom.xml> to org.wso2.analytics.http/ui-pages/1.0.0-SNAPSHOT/ui-pages-1.0.0-SNAPSHOT.pom
[JENKINS] Archiving <https://wso2.org/jenkins/job/analytics-products/job/analytics-http/ws/product/integration/tests-common/ui-pages/target/ui-pages-1.0.0-SNAPSHOT.jar> to org.wso2.analytics.http/ui-pages/1.0.0-SNAPSHOT/ui-pages-1.0.0-SNAPSHOT.jar
[JENKINS] Archiving <https://wso2.org/jenkins/job/analytics-products/job/analytics-http/ws/product/integration/tests-ui-integration/pom.xml> to org.wso2.analytics.http/das4http-integration-ui-tests/1.0.0-SNAPSHOT/das4http-integration-ui-tests-1.0.0-SNAPSHOT.pom
[JENKINS] Archiving <https://wso2.org/jenkins/job/analytics-products/job/analytics-http/ws/product/integration/tests-ui-integration/tests-ui/pom.xml> to org.wso2.analytics.http/org.wso2.das4http.ui.integration.test/1.0.0-SNAPSHOT/org.wso2.das4http.ui.integration.test-1.0.0-SNAPSHOT.pom
[JENKINS] Archiving <https://wso2.org/jenkins/job/analytics-products/job/analytics-http/ws/components/org.wso2.analytics.http/pom.xml> to org.wso2.analytics.http/org.wso2.analytics.http/1.0.0-SNAPSHOT/org.wso2.analytics.http-1.0.0-SNAPSHOT.pom
[JENKINS] Archiving <https://wso2.org/jenkins/job/analytics-products/job/analytics-http/ws/components/org.wso2.analytics.http/target/org.wso2.analytics.http-1.0.0-SNAPSHOT.jar> to org.wso2.analytics.http/org.wso2.analytics.http/1.0.0-SNAPSHOT/org.wso2.analytics.http-1.0.0-SNAPSHOT.jar
[JENKINS] Archiving <https://wso2.org/jenkins/job/analytics-products/job/analytics-http/ws/components/pom.xml> to org.wso2.analytics.http/analytics-http-components/1.0.0-SNAPSHOT/analytics-http-components-1.0.0-SNAPSHOT.pom
[JENKINS] Archiving <https://wso2.org/jenkins/job/analytics-products/job/analytics-http/ws/product/styles/service/pom.xml> to org.wso2.analytics.http/org.wso2.das4http.multitenancy.styles/1.0.0-SNAPSHOT/org.wso2.das4http.multitenancy.styles-1.0.0-SNAPSHOT.pom
[JENKINS] Archiving <https://wso2.org/jenkins/job/analytics-products/job/analytics-http/ws/product/styles/service/target/org.wso2.das4http.multitenancy.styles-1.0.0-SNAPSHOT.jar> to org.wso2.analytics.http/org.wso2.das4http.multitenancy.styles/1.0.0-SNAPSHOT/org.wso2.das4http.multitenancy.styles-1.0.0-SNAPSHOT.jar
[JENKINS] Archiving <https://wso2.org/jenkins/job/analytics-products/job/analytics-http/ws/product/features/service/pom.xml> to org.wso2.analytics.http/wso2analytics-http-multitenancy-features/1.0.0-SNAPSHOT/wso2analytics-http-multitenancy-features-1.0.0-SNAPSHOT.pom
[JENKINS] Archiving <https://wso2.org/jenkins/job/analytics-products/job/analytics-http/ws/features/org.wso2.analytics.http.feature/pom.xml> to org.wso2.analytics.http/org.wso2.analytics.http.feature/1.0.0-SNAPSHOT/org.wso2.analytics.http.feature-1.0.0-SNAPSHOT.pom
[JENKINS] Archiving <https://wso2.org/jenkins/job/analytics-products/job/analytics-http/ws/features/org.wso2.analytics.http.feature/target/org.wso2.analytics.http.feature-1.0.0-SNAPSHOT.zip> to org.wso2.analytics.http/org.wso2.analytics.http.feature/1.0.0-SNAPSHOT/org.wso2.analytics.http.feature-1.0.0-SNAPSHOT.jar
[JENKINS] Archiving <https://wso2.org/jenkins/job/analytics-products/job/analytics-http/ws/features/org.wso2.analytics.http.feature/target/org.wso2.analytics.http.feature-1.0.0-SNAPSHOT.zip> to org.wso2.analytics.http/org.wso2.analytics.http.feature/1.0.0-SNAPSHOT/org.wso2.analytics.http.feature-1.0.0-SNAPSHOT.zip
[JENKINS] Archiving <https://wso2.org/jenkins/job/analytics-products/job/analytics-http/ws/product/styles/pom.xml> to org.wso2.analytics.http/org.wso2.das4http.styles.parent/1.0.0-SNAPSHOT/org.wso2.das4http.styles.parent-1.0.0-SNAPSHOT.pom
[JENKINS] Archiving <https://wso2.org/jenkins/job/analytics-products/job/analytics-http/ws/product/features/pom.xml> to org.wso2.analytics.http/wso2analytics-http-features-parent/1.0.0-SNAPSHOT/wso2analytics-http-features-parent-1.0.0-SNAPSHOT.pom
[JENKINS] Archiving <https://wso2.org/jenkins/job/analytics-products/job/analytics-http/ws/features/pom.xml> to org.wso2.analytics.http/analytics-http-features/1.0.0-SNAPSHOT/analytics-http-features-1.0.0-SNAPSHOT.pom
[JENKINS] Archiving <https://wso2.org/jenkins/job/analytics-products/job/analytics-http/ws/product/distribution/pom.xml> to org.wso2.analytics.http/wso2http-analytics/1.0.0-SNAPSHOT/wso2http-analytics-1.0.0-SNAPSHOT.pom
[JENKINS] Archiving <https://wso2.org/jenkins/job/analytics-products/job/analytics-http/ws/product/distribution/target/wso2http-analytics-1.0.0-SNAPSHOT.zip> to org.wso2.analytics.http/wso2http-analytics/1.0.0-SNAPSHOT/wso2http-analytics-1.0.0-SNAPSHOT.zip
[JENKINS] Archiving <https://wso2.org/jenkins/job/analytics-products/job/analytics-http/ws/product/features/product/pom.xml> to org.wso2.analytics.http/wso2analytics-http-features/1.0.0-SNAPSHOT/wso2analytics-http-features-1.0.0-SNAPSHOT.pom
[JENKINS] Archiving <https://wso2.org/jenkins/job/analytics-products/job/analytics-http/ws/product/integration/tests-common/admin-clients/pom.xml> to org.wso2.analytics.http/org.wso2.das4http.integration.common.clients/1.0.0-SNAPSHOT/org.wso2.das4http.integration.common.clients-1.0.0-SNAPSHOT.pom
[JENKINS] Archiving <https://wso2.org/jenkins/job/analytics-products/job/analytics-http/ws/product/integration/tests-common/admin-clients/target/org.wso2.das4http.integration.common.clients-1.0.0-SNAPSHOT.jar> to org.wso2.analytics.http/org.wso2.das4http.integration.common.clients/1.0.0-SNAPSHOT/org.wso2.das4http.integration.common.clients-1.0.0-SNAPSHOT.jar
[JENKINS] Archiving <https://wso2.org/jenkins/job/analytics-products/job/analytics-http/ws/product/features/service/org.wso2.das4http.multitenancy.styles.feature/target/org.wso2.das4http.multitenancy.style.feature-1.0.0-SNAPSHOT.zip> to org.wso2.analytics.http/org.wso2.das4http.multitenancy.style.feature/1.0.0-SNAPSHOT/org.wso2.das4http.multitenancy.style.feature-1.0.0-SNAPSHOT.pom
[JENKINS] Archiving <https://wso2.org/jenkins/job/analytics-products/job/analytics-http/ws/product/features/service/org.wso2.das4http.multitenancy.styles.feature/target/org.wso2.das4http.multitenancy.style.feature-1.0.0-SNAPSHOT.zip> to org.wso2.analytics.http/org.wso2.das4http.multitenancy.style.feature/1.0.0-SNAPSHOT/org.wso2.das4http.multitenancy.style.feature-1.0.0-SNAPSHOT.zip
[JENKINS] Archiving <https://wso2.org/jenkins/job/analytics-products/job/analytics-http/ws/product/integration/tests-integration/pom.xml> to org.wso2.analytics.http/org.wso2.das4http.integration.tests/1.0.0-SNAPSHOT/org.wso2.das4http.integration.tests-1.0.0-SNAPSHOT.pom
[JENKINS] Archiving <https://wso2.org/jenkins/job/analytics-products/job/analytics-http/ws/product/features/service/org.wso2.das4http.multitenancy.dashboard.ui.feature/target/org.wso2.das4http.multitenancy.dashboard.ui.feature-1.0.0-SNAPSHOT.zip> to org.wso2.analytics.http/org.wso2.das4http.multitenancy.dashboard.ui.feature/1.0.0-SNAPSHOT/org.wso2.das4http.multitenancy.dashboard.ui.feature-1.0.0-SNAPSHOT.pom
[JENKINS] Archiving <https://wso2.org/jenkins/job/analytics-products/job/analytics-http/ws/product/features/service/org.wso2.das4http.multitenancy.dashboard.ui.feature/target/org.wso2.das4http.multitenancy.dashboard.ui.feature-1.0.0-SNAPSHOT.zip> to org.wso2.analytics.http/org.wso2.das4http.multitenancy.dashboard.ui.feature/1.0.0-SNAPSHOT/org.wso2.das4http.multitenancy.dashboard.ui.feature-1.0.0-SNAPSHOT.zip
Sending e-mails to: builder at wso2.org
channel stopped
[BFA] Scanning build for known causes...
.[BFA] No failure causes found
[BFA] Done. 1s


More information about the Builder mailing list