[Builder] Build failed in Jenkins: platform-builds » identity-anonymization-tool #5

cbuilder at wso2.org cbuilder at wso2.org
Wed Feb 14 07:53:04 PST 2018


See <https://wso2.org/jenkins/job/platform-builds/job/identity-anonymization-tool/5/display/redirect?page=changes>

Changes:

[JKAUSHALYA] Add facility to map directory to datasource.

------------------------------------------
[...truncated 24.87 KB...]
Downloading: http://repo.maven.apache.org/maven2/org/codehaus/plexus/plexus/1.0.12/plexus-1.0.12.pom
Downloaded: http://repo.maven.apache.org/maven2/org/codehaus/plexus/plexus/1.0.12/plexus-1.0.12.pom (10 KB at 24.2 KB/sec)
Downloading: http://repo.maven.apache.org/maven2/classworlds/classworlds/1.1-alpha-2/classworlds-1.1-alpha-2.pom
Downloaded: http://repo.maven.apache.org/maven2/classworlds/classworlds/1.1-alpha-2/classworlds-1.1-alpha-2.pom (4 KB at 7.7 KB/sec)
Downloading: http://repo.maven.apache.org/maven2/org/codehaus/plexus/plexus-interactivity-api/1.0-alpha-6/plexus-interactivity-api-1.0-alpha-6.pom
Downloaded: http://repo.maven.apache.org/maven2/org/codehaus/plexus/plexus-interactivity-api/1.0-alpha-6/plexus-interactivity-api-1.0-alpha-6.pom (726 B at 1.8 KB/sec)
Downloading: http://repo.maven.apache.org/maven2/org/codehaus/plexus/plexus-interactivity/1.0-alpha-6/plexus-interactivity-1.0-alpha-6.pom
Downloaded: http://repo.maven.apache.org/maven2/org/codehaus/plexus/plexus-interactivity/1.0-alpha-6/plexus-interactivity-1.0-alpha-6.pom (2 KB at 2.6 KB/sec)
Downloading: http://repo.maven.apache.org/maven2/org/codehaus/plexus/plexus-components/1.1.9/plexus-components-1.1.9.pom
Downloaded: http://repo.maven.apache.org/maven2/org/codehaus/plexus/plexus-components/1.1.9/plexus-components-1.1.9.pom (3 KB at 6.0 KB/sec)
Downloading: http://repo.maven.apache.org/maven2/org/codehaus/plexus/plexus/1.0.10/plexus-1.0.10.pom
Downloaded: http://repo.maven.apache.org/maven2/org/codehaus/plexus/plexus/1.0.10/plexus-1.0.10.pom (9 KB at 20.5 KB/sec)
Downloading: http://repo.maven.apache.org/maven2/org/apache/maven/maven-model/2.0.9/maven-model-2.0.9.pom
Downloaded: http://repo.maven.apache.org/maven2/org/apache/maven/maven-model/2.0.9/maven-model-2.0.9.pom (4 KB at 7.8 KB/sec)
Downloading: http://repo.maven.apache.org/maven2/org/apache/maven/maven-artifact/2.0.9/maven-artifact-2.0.9.pom
Downloaded: http://repo.maven.apache.org/maven2/org/apache/maven/maven-artifact/2.0.9/maven-artifact-2.0.9.pom (2 KB at 4.0 KB/sec)
Downloading: http://repo.maven.apache.org/maven2/org/apache/maven/maven-artifact-manager/2.0.9/maven-artifact-manager-2.0.9.pom
Downloaded: http://repo.maven.apache.org/maven2/org/apache/maven/maven-artifact-manager/2.0.9/maven-artifact-manager-2.0.9.pom (3 KB at 6.7 KB/sec)
Downloading: http://repo.maven.apache.org/maven2/org/apache/maven/maven-repository-metadata/2.0.9/maven-repository-metadata-2.0.9.pom
Downloaded: http://repo.maven.apache.org/maven2/org/apache/maven/maven-repository-metadata/2.0.9/maven-repository-metadata-2.0.9.pom (2 KB at 4.7 KB/sec)
Downloading: http://repo.maven.apache.org/maven2/org/codehaus/plexus/plexus-container-default/1.0-alpha-9-stable-1/plexus-container-default-1.0-alpha-9-stable-1.pom
Downloaded: http://repo.maven.apache.org/maven2/org/codehaus/plexus/plexus-container-default/1.0-alpha-9-stable-1/plexus-container-default-1.0-alpha-9-stable-1.pom (4 KB at 9.8 KB/sec)
Downloading: http://repo.maven.apache.org/maven2/org/apache/maven/maven-project/2.0.9/maven-project-2.0.9.pom
Downloaded: http://repo.maven.apache.org/maven2/org/apache/maven/maven-project/2.0.9/maven-project-2.0.9.pom (3 KB at 6.7 KB/sec)
Downloading: http://repo.maven.apache.org/maven2/org/apache/maven/maven-settings/2.0.9/maven-settings-2.0.9.pom
Downloaded: http://repo.maven.apache.org/maven2/org/apache/maven/maven-settings/2.0.9/maven-settings-2.0.9.pom (3 KB at 5.1 KB/sec)
Downloading: http://repo.maven.apache.org/maven2/org/apache/maven/maven-profile/2.0.9/maven-profile-2.0.9.pom
Downloaded: http://repo.maven.apache.org/maven2/org/apache/maven/maven-profile/2.0.9/maven-profile-2.0.9.pom (3 KB at 5.0 KB/sec)
Downloading: http://repo.maven.apache.org/maven2/org/apache/maven/maven-plugin-registry/2.0.9/maven-plugin-registry-2.0.9.pom
Downloaded: http://repo.maven.apache.org/maven2/org/apache/maven/maven-plugin-registry/2.0.9/maven-plugin-registry-2.0.9.pom (2 KB at 4.9 KB/sec)
Downloading: http://repo.maven.apache.org/maven2/org/apache/maven/shared/maven-invoker/2.0.9/maven-invoker-2.0.9.pom
Downloaded: http://repo.maven.apache.org/maven2/org/apache/maven/shared/maven-invoker/2.0.9/maven-invoker-2.0.9.pom (6 KB at 14.1 KB/sec)
Downloading: http://repo.maven.apache.org/maven2/org/apache/maven/shared/maven-shared-components/9/maven-shared-components-9.pom
Downloaded: http://repo.maven.apache.org/maven2/org/apache/maven/shared/maven-shared-components/9/maven-shared-components-9.pom (4 KB at 8.6 KB/sec)
Downloading: http://repo.maven.apache.org/maven2/commons-lang/commons-lang/2.4/commons-lang-2.4.pom
Downloaded: http://repo.maven.apache.org/maven2/commons-lang/commons-lang/2.4/commons-lang-2.4.pom (14 KB at 34.5 KB/sec)
Downloading: http://repo.maven.apache.org/maven2/org/apache/commons/commons-parent/9/commons-parent-9.pom
Downloaded: http://repo.maven.apache.org/maven2/org/apache/commons/commons-parent/9/commons-parent-9.pom (22 KB at 53.8 KB/sec)
Downloading: http://repo.maven.apache.org/maven2/commons-cli/commons-cli/1.0/commons-cli-1.0.pom
Downloaded: http://repo.maven.apache.org/maven2/commons-cli/commons-cli/1.0/commons-cli-1.0.pom (3 KB at 5.2 KB/sec)
Downloading: http://repo.maven.apache.org/maven2/commons-logging/commons-logging/1.0/commons-logging-1.0.pom
Downloaded: http://repo.maven.apache.org/maven2/commons-logging/commons-logging/1.0/commons-logging-1.0.pom (163 B at 0.4 KB/sec)
Downloading: http://repo.maven.apache.org/maven2/org/apache/maven/scm/maven-scm-providers-standard/1.3/maven-scm-providers-standard-1.3.pom
Downloaded: http://repo.maven.apache.org/maven2/org/apache/maven/scm/maven-scm-providers-standard/1.3/maven-scm-providers-standard-1.3.pom (4 KB at 8.9 KB/sec)
Downloading: http://repo.maven.apache.org/maven2/org/apache/maven/scm/maven-scm-providers/1.3/maven-scm-providers-1.3.pom
Downloaded: http://repo.maven.apache.org/maven2/org/apache/maven/scm/maven-scm-providers/1.3/maven-scm-providers-1.3.pom (4 KB at 9.0 KB/sec)
Downloading: http://repo.maven.apache.org/maven2/org/apache/maven/scm/maven-scm/1.3/maven-scm-1.3.pom
Downloaded: http://repo.maven.apache.org/maven2/org/apache/maven/scm/maven-scm/1.3/maven-scm-1.3.pom (12 KB at 29.6 KB/sec)
Downloading: http://repo.maven.apache.org/maven2/org/apache/maven/scm/maven-scm-provider-accurev/1.3/maven-scm-provider-accurev-1.3.pom
Downloaded: http://repo.maven.apache.org/maven2/org/apache/maven/scm/maven-scm-provider-accurev/1.3/maven-scm-provider-accurev-1.3.pom (5 KB at 11.3 KB/sec)
Downloading: http://repo.maven.apache.org/maven2/org/apache/maven/scm/maven-scm-api/1.3/maven-scm-api-1.3.pom
Downloaded: http://repo.maven.apache.org/maven2/org/apache/maven/scm/maven-scm-api/1.3/maven-scm-api-1.3.pom (2 KB at 3.9 KB/sec)
Downloading: http://repo.maven.apache.org/maven2/org/apache/maven/scm/maven-scm-provider-bazaar/1.3/maven-scm-provider-bazaar-1.3.pom
Downloaded: http://repo.maven.apache.org/maven2/org/apache/maven/scm/maven-scm-provider-bazaar/1.3/maven-scm-provider-bazaar-1.3.pom (2 KB at 4.8 KB/sec)
Downloading: http://repo.maven.apache.org/maven2/regexp/regexp/1.3/regexp-1.3.pom
Downloaded: http://repo.maven.apache.org/maven2/regexp/regexp/1.3/regexp-1.3.pom (145 B at 0.4 KB/sec)
Downloading: http://repo.maven.apache.org/maven2/org/apache/maven/scm/maven-scm-provider-clearcase/1.3/maven-scm-provider-clearcase-1.3.pom
Downloaded: http://repo.maven.apache.org/maven2/org/apache/maven/scm/maven-scm-provider-clearcase/1.3/maven-scm-provider-clearcase-1.3.pom (3 KB at 5.9 KB/sec)
Downloading: http://repo.maven.apache.org/maven2/org/apache/maven/scm/maven-scm-provider-cvsexe/1.3/maven-scm-provider-cvsexe-1.3.pom
Downloaded: http://repo.maven.apache.org/maven2/org/apache/maven/scm/maven-scm-provider-cvsexe/1.3/maven-scm-provider-cvsexe-1.3.pom (3 KB at 6.4 KB/sec)
Downloading: http://repo.maven.apache.org/maven2/org/apache/maven/scm/maven-scm-providers-cvs/1.3/maven-scm-providers-cvs-1.3.pom
Downloaded: http://repo.maven.apache.org/maven2/org/apache/maven/scm/maven-scm-providers-cvs/1.3/maven-scm-providers-cvs-1.3.pom (2 KB at 4.2 KB/sec)
Downloading: http://repo.maven.apache.org/maven2/org/apache/maven/scm/maven-scm-provider-cvs-commons/1.3/maven-scm-provider-cvs-commons-1.3.pom
Downloaded: http://repo.maven.apache.org/maven2/org/apache/maven/scm/maven-scm-provider-cvs-commons/1.3/maven-scm-provider-cvs-commons-1.3.pom (3 KB at 5.6 KB/sec)
Downloading: http://repo.maven.apache.org/maven2/org/apache/maven/scm/maven-scm-provider-cvsjava/1.3/maven-scm-provider-cvsjava-1.3.pom
Downloaded: http://repo.maven.apache.org/maven2/org/apache/maven/scm/maven-scm-provider-cvsjava/1.3/maven-scm-provider-cvsjava-1.3.pom (3 KB at 6.1 KB/sec)
Downloading: http://repo.maven.apache.org/maven2/org/netbeans/lib/cvsclient/20060125/cvsclient-20060125.pom
Downloaded: http://repo.maven.apache.org/maven2/org/netbeans/lib/cvsclient/20060125/cvsclient-20060125.pom (459 B at 1.1 KB/sec)
Downloading: http://repo.maven.apache.org/maven2/ch/ethz/ganymed/ganymed-ssh2/build210/ganymed-ssh2-build210.pom
Downloaded: http://repo.maven.apache.org/maven2/ch/ethz/ganymed/ganymed-ssh2/build210/ganymed-ssh2-build210.pom (710 B at 1.8 KB/sec)
Downloading: http://repo.maven.apache.org/maven2/org/apache/maven/scm/maven-scm-provider-gitexe/1.3/maven-scm-provider-gitexe-1.3.pom
Downloaded: http://repo.maven.apache.org/maven2/org/apache/maven/scm/maven-scm-provider-gitexe/1.3/maven-scm-provider-gitexe-1.3.pom (3 KB at 5.7 KB/sec)
Downloading: http://repo.maven.apache.org/maven2/org/apache/maven/scm/maven-scm-providers-git/1.3/maven-scm-providers-git-1.3.pom
Downloaded: http://repo.maven.apache.org/maven2/org/apache/maven/scm/maven-scm-providers-git/1.3/maven-scm-providers-git-1.3.pom (3 KB at 5.5 KB/sec)
Downloading: http://repo.maven.apache.org/maven2/org/apache/maven/scm/maven-scm-provider-git-commons/1.3/maven-scm-provider-git-commons-1.3.pom
Downloaded: http://repo.maven.apache.org/maven2/org/apache/maven/scm/maven-scm-provider-git-commons/1.3/maven-scm-provider-git-commons-1.3.pom (3 KB at 5.4 KB/sec)
Downloading: http://repo.maven.apache.org/maven2/org/apache/maven/scm/maven-scm-provider-hg/1.3/maven-scm-provider-hg-1.3.pom
Downloaded: http://repo.maven.apache.org/maven2/org/apache/maven/scm/maven-scm-provider-hg/1.3/maven-scm-provider-hg-1.3.pom (3 KB at 5.7 KB/sec)
Downloading: http://repo.maven.apache.org/maven2/org/apache/maven/scm/maven-scm-provider-perforce/1.3/maven-scm-provider-perforce-1.3.pom
Downloaded: http://repo.maven.apache.org/maven2/org/apache/maven/scm/maven-scm-provider-perforce/1.3/maven-scm-provider-perforce-1.3.pom (3 KB at 6.2 KB/sec)
Downloading: http://repo.maven.apache.org/maven2/org/apache/maven/scm/maven-scm-provider-starteam/1.3/maven-scm-provider-starteam-1.3.pom
Downloaded: http://repo.maven.apache.org/maven2/org/apache/maven/scm/maven-scm-provider-starteam/1.3/maven-scm-provider-starteam-1.3.pom (3 KB at 5.7 KB/sec)
Downloading: http://repo.maven.apache.org/maven2/org/apache/maven/scm/maven-scm-provider-svnexe/1.3/maven-scm-provider-svnexe-1.3.pom
Downloaded: http://repo.maven.apache.org/maven2/org/apache/maven/scm/maven-scm-provider-svnexe/1.3/maven-scm-provider-svnexe-1.3.pom (3 KB at 5.6 KB/sec)
Downloading: http://repo.maven.apache.org/maven2/org/apache/maven/scm/maven-scm-providers-svn/1.3/maven-scm-providers-svn-1.3.pom
Downloaded: http://repo.maven.apache.org/maven2/org/apache/maven/scm/maven-scm-providers-svn/1.3/maven-scm-providers-svn-1.3.pom (3 KB at 5.2 KB/sec)
Downloading: http://repo.maven.apache.org/maven2/org/apache/maven/scm/maven-scm-provider-svn-commons/1.3/maven-scm-provider-svn-commons-1.3.pom
Downloaded: http://repo.maven.apache.org/maven2/org/apache/maven/scm/maven-scm-provider-svn-commons/1.3/maven-scm-provider-svn-commons-1.3.pom (3 KB at 5.1 KB/sec)
Downloading: http://repo.maven.apache.org/maven2/org/apache/maven/scm/maven-scm-provider-synergy/1.3/maven-scm-provider-synergy-1.3.pom
Downloaded: http://repo.maven.apache.org/maven2/org/apache/maven/scm/maven-scm-provider-synergy/1.3/maven-scm-provider-synergy-1.3.pom (2 KB at 4.6 KB/sec)
Downloading: http://repo.maven.apache.org/maven2/org/apache/maven/scm/maven-scm-provider-vss/1.3/maven-scm-provider-vss-1.3.pom
Downloaded: http://repo.maven.apache.org/maven2/org/apache/maven/scm/maven-scm-provider-vss/1.3/maven-scm-provider-vss-1.3.pom (3 KB at 6.0 KB/sec)
Downloading: http://repo.maven.apache.org/maven2/org/apache/maven/scm/maven-scm-provider-tfs/1.3/maven-scm-provider-tfs-1.3.pom
Downloaded: http://repo.maven.apache.org/maven2/org/apache/maven/scm/maven-scm-provider-tfs/1.3/maven-scm-provider-tfs-1.3.pom (3 KB at 6.4 KB/sec)
Downloading: http://repo.maven.apache.org/maven2/org/apache/maven/scm/maven-scm-manager-plexus/1.3/maven-scm-manager-plexus-1.3.pom
Downloaded: http://repo.maven.apache.org/maven2/org/apache/maven/scm/maven-scm-manager-plexus/1.3/maven-scm-manager-plexus-1.3.pom (3 KB at 5.1 KB/sec)
Downloading: http://repo.maven.apache.org/maven2/org/apache/maven/scm/maven-scm-managers/1.3/maven-scm-managers-1.3.pom
Downloaded: http://repo.maven.apache.org/maven2/org/apache/maven/scm/maven-scm-managers/1.3/maven-scm-managers-1.3.pom (2 KB at 3.7 KB/sec)
Downloading: http://repo.maven.apache.org/maven2/org/jdom/jdom/1.1/jdom-1.1.pom
Downloaded: http://repo.maven.apache.org/maven2/org/jdom/jdom/1.1/jdom-1.1.pom (3 KB at 5.4 KB/sec)
Downloading: http://repo.maven.apache.org/maven2/jaxen/jaxen/1.1-beta-8/jaxen-1.1-beta-8.pom
Downloaded: http://repo.maven.apache.org/maven2/jaxen/jaxen/1.1-beta-8/jaxen-1.1-beta-8.pom (7 KB at 16.6 KB/sec)
Downloading: http://repo.maven.apache.org/maven2/jdom/jdom/1.0/jdom-1.0.pom
Downloaded: http://repo.maven.apache.org/maven2/jdom/jdom/1.0/jdom-1.0.pom (2 KB at 2.9 KB/sec)
Downloading: http://repo.maven.apache.org/maven2/org/apache/maven/maven-core/2.0.9/maven-core-2.0.9.pom
Downloaded: http://repo.maven.apache.org/maven2/org/apache/maven/maven-core/2.0.9/maven-core-2.0.9.pom (8 KB at 19.3 KB/sec)
Downloading: http://repo.maven.apache.org/maven2/org/apache/maven/maven-plugin-parameter-documenter/2.0.9/maven-plugin-parameter-documenter-2.0.9.pom
Downloaded: http://repo.maven.apache.org/maven2/org/apache/maven/maven-plugin-parameter-documenter/2.0.9/maven-plugin-parameter-documenter-2.0.9.pom (2 KB at 4.9 KB/sec)
Downloading: http://repo.maven.apache.org/maven2/org/apache/maven/reporting/maven-reporting-api/2.0.9/maven-reporting-api-2.0.9.pom
Downloaded: http://repo.maven.apache.org/maven2/org/apache/maven/reporting/maven-reporting-api/2.0.9/maven-reporting-api-2.0.9.pom (2 KB at 4.5 KB/sec)
Downloading: http://repo.maven.apache.org/maven2/org/apache/maven/reporting/maven-reporting/2.0.9/maven-reporting-2.0.9.pom
Downloaded: http://repo.maven.apache.org/maven2/org/apache/maven/reporting/maven-reporting/2.0.9/maven-reporting-2.0.9.pom (2 KB at 3.6 KB/sec)
Downloading: http://repo.maven.apache.org/maven2/org/apache/maven/doxia/doxia-sink-api/1.0-alpha-10/doxia-sink-api-1.0-alpha-10.pom
Downloaded: http://repo.maven.apache.org/maven2/org/apache/maven/doxia/doxia-sink-api/1.0-alpha-10/doxia-sink-api-1.0-alpha-10.pom (2 KB at 3.3 KB/sec)
Downloading: http://repo.maven.apache.org/maven2/org/apache/maven/doxia/doxia/1.0-alpha-10/doxia-1.0-alpha-10.pom
Downloaded: http://repo.maven.apache.org/maven2/org/apache/maven/doxia/doxia/1.0-alpha-10/doxia-1.0-alpha-10.pom (9 KB at 22.6 KB/sec)
Downloading: http://repo.maven.apache.org/maven2/org/apache/maven/maven-parent/6/maven-parent-6.pom
Downloaded: http://repo.maven.apache.org/maven2/org/apache/maven/maven-parent/6/maven-parent-6.pom (20 KB at 48.7 KB/sec)
Downloading: http://repo.maven.apache.org/maven2/org/apache/maven/maven-error-diagnostics/2.0.9/maven-error-diagnostics-2.0.9.pom
Downloaded: http://repo.maven.apache.org/maven2/org/apache/maven/maven-error-diagnostics/2.0.9/maven-error-diagnostics-2.0.9.pom (2 KB at 4.3 KB/sec)
Downloading: http://repo.maven.apache.org/maven2/org/apache/maven/maven-plugin-descriptor/2.0.9/maven-plugin-descriptor-2.0.9.pom
Downloaded: http://repo.maven.apache.org/maven2/org/apache/maven/maven-plugin-descriptor/2.0.9/maven-plugin-descriptor-2.0.9.pom (3 KB at 5.2 KB/sec)
Downloading: http://repo.maven.apache.org/maven2/org/codehaus/plexus/plexus-interactivity-api/1.0-alpha-4/plexus-interactivity-api-1.0-alpha-4.pom
Downloaded: http://repo.maven.apache.org/maven2/org/codehaus/plexus/plexus-interactivity-api/1.0-alpha-4/plexus-interactivity-api-1.0-alpha-4.pom (7 KB at 17.6 KB/sec)
Downloading: http://repo.maven.apache.org/maven2/org/apache/maven/maven-monitor/2.0.9/maven-monitor-2.0.9.pom
Downloaded: http://repo.maven.apache.org/maven2/org/apache/maven/maven-monitor/2.0.9/maven-monitor-2.0.9.pom (2 KB at 3.2 KB/sec)
Downloading: http://repo.maven.apache.org/maven2/classworlds/classworlds/1.1/classworlds-1.1.pom
Downloaded: http://repo.maven.apache.org/maven2/classworlds/classworlds/1.1/classworlds-1.1.pom (4 KB at 8.3 KB/sec)
Downloading: http://repo.maven.apache.org/maven2/org/apache/maven/release/maven-release-manager/2.0/maven-release-manager-2.0.jar
Downloading: http://repo.maven.apache.org/maven2/junit/junit/3.8.1/junit-3.8.1.jar
Downloading: http://repo.maven.apache.org/maven2/org/codehaus/plexus/plexus-interactivity-api/1.0-alpha-6/plexus-interactivity-api-1.0-alpha-6.jar
Downloading: http://repo.maven.apache.org/maven2/org/apache/maven/shared/maven-invoker/2.0.9/maven-invoker-2.0.9.jar
Downloading: http://repo.maven.apache.org/maven2/commons-lang/commons-lang/2.4/commons-lang-2.4.jar
Downloaded: http://repo.maven.apache.org/maven2/org/apache/maven/release/maven-release-manager/2.0/maven-release-manager-2.0.jar (156 KB at 358.8 KB/sec)
Downloading: http://repo.maven.apache.org/maven2/commons-cli/commons-cli/1.0/commons-cli-1.0.jar
Downloaded: http://repo.maven.apache.org/maven2/org/codehaus/plexus/plexus-interactivity-api/1.0-alpha-6/plexus-interactivity-api-1.0-alpha-6.jar (12 KB at 21.6 KB/sec)
Downloading: http://repo.maven.apache.org/maven2/commons-logging/commons-logging/1.0/commons-logging-1.0.jar
Downloaded: http://repo.maven.apache.org/maven2/org/apache/maven/shared/maven-invoker/2.0.9/maven-invoker-2.0.9.jar (28 KB at 35.9 KB/sec)
Downloading: http://repo.maven.apache.org/maven2/org/apache/maven/scm/maven-scm-provider-accurev/1.3/maven-scm-provider-accurev-1.3.jar
Downloaded: http://repo.maven.apache.org/maven2/commons-cli/commons-cli/1.0/commons-cli-1.0.jar (30 KB at 73.9 KB/sec)
Downloading: http://repo.maven.apache.org/maven2/org/apache/maven/scm/maven-scm-provider-bazaar/1.3/maven-scm-provider-bazaar-1.3.jar
Downloaded: http://repo.maven.apache.org/maven2/commons-logging/commons-logging/1.0/commons-logging-1.0.jar (22 KB at 50.7 KB/sec)
Downloading: http://repo.maven.apache.org/maven2/regexp/regexp/1.3/regexp-1.3.jar
Downloaded: http://repo.maven.apache.org/maven2/junit/junit/3.8.1/junit-3.8.1.jar (119 KB at 107.3 KB/sec)
Downloading: http://repo.maven.apache.org/maven2/org/apache/maven/scm/maven-scm-provider-clearcase/1.3/maven-scm-provider-clearcase-1.3.jar
Downloaded: http://repo.maven.apache.org/maven2/org/apache/maven/scm/maven-scm-provider-accurev/1.3/maven-scm-provider-accurev-1.3.jar (27 KB at 57.4 KB/sec)
Downloading: http://repo.maven.apache.org/maven2/org/apache/maven/scm/maven-scm-provider-cvsexe/1.3/maven-scm-provider-cvsexe-1.3.jar
Downloaded: http://repo.maven.apache.org/maven2/org/apache/maven/scm/maven-scm-provider-bazaar/1.3/maven-scm-provider-bazaar-1.3.jar (50 KB at 122.9 KB/sec)
Downloading: http://repo.maven.apache.org/maven2/org/apache/maven/scm/maven-scm-provider-cvs-commons/1.3/maven-scm-provider-cvs-commons-1.3.jar
Downloaded: http://repo.maven.apache.org/maven2/commons-lang/commons-lang/2.4/commons-lang-2.4.jar (256 KB at 202.9 KB/sec)
Downloading: http://repo.maven.apache.org/maven2/org/apache/maven/scm/maven-scm-provider-cvsjava/1.3/maven-scm-provider-cvsjava-1.3.jar
Downloaded: http://repo.maven.apache.org/maven2/regexp/regexp/1.3/regexp-1.3.jar (25 KB at 62.4 KB/sec)
Downloading: http://repo.maven.apache.org/maven2/org/netbeans/lib/cvsclient/20060125/cvsclient-20060125.jar
Downloaded: http://repo.maven.apache.org/maven2/org/apache/maven/scm/maven-scm-provider-clearcase/1.3/maven-scm-provider-clearcase-1.3.jar (64 KB at 155.6 KB/sec)
Downloading: http://repo.maven.apache.org/maven2/ch/ethz/ganymed/ganymed-ssh2/build210/ganymed-ssh2-build210.jar
Downloaded: http://repo.maven.apache.org/maven2/org/apache/maven/scm/maven-scm-provider-cvsjava/1.3/maven-scm-provider-cvsjava-1.3.jar (40 KB at 108.1 KB/sec)
Downloading: http://repo.maven.apache.org/maven2/org/apache/maven/scm/maven-scm-provider-gitexe/1.3/maven-scm-provider-gitexe-1.3.jar
Downloaded: http://repo.maven.apache.org/maven2/org/apache/maven/scm/maven-scm-provider-cvsexe/1.3/maven-scm-provider-cvsexe-1.3.jar (27 KB at 64.7 KB/sec)
Downloading: http://repo.maven.apache.org/maven2/org/apache/maven/scm/maven-scm-provider-git-commons/1.3/maven-scm-provider-git-commons-1.3.jar
Downloaded: http://repo.maven.apache.org/maven2/org/apache/maven/scm/maven-scm-provider-cvs-commons/1.3/maven-scm-provider-cvs-commons-1.3.jar (71 KB at 164.4 KB/sec)
Downloading: http://repo.maven.apache.org/maven2/org/apache/maven/scm/maven-scm-provider-hg/1.3/maven-scm-provider-hg-1.3.jar
Downloaded: http://repo.maven.apache.org/maven2/org/apache/maven/scm/maven-scm-provider-gitexe/1.3/maven-scm-provider-gitexe-1.3.jar (49 KB at 129.5 KB/sec)
Downloading: http://repo.maven.apache.org/maven2/org/apache/maven/scm/maven-scm-provider-perforce/1.3/maven-scm-provider-perforce-1.3.jar
Downloaded: http://repo.maven.apache.org/maven2/org/apache/maven/scm/maven-scm-provider-git-commons/1.3/maven-scm-provider-git-commons-1.3.jar (36 KB at 84.0 KB/sec)
Downloading: http://repo.maven.apache.org/maven2/org/apache/maven/scm/maven-scm-provider-starteam/1.3/maven-scm-provider-starteam-1.3.jar
Downloaded: http://repo.maven.apache.org/maven2/org/apache/maven/scm/maven-scm-provider-hg/1.3/maven-scm-provider-hg-1.3.jar (52 KB at 126.2 KB/sec)
Downloading: http://repo.maven.apache.org/maven2/org/apache/maven/scm/maven-scm-provider-svnexe/1.3/maven-scm-provider-svnexe-1.3.jar
Downloaded: http://repo.maven.apache.org/maven2/ch/ethz/ganymed/ganymed-ssh2/build210/ganymed-ssh2-build210.jar (240 KB at 399.8 KB/sec)
Downloading: http://repo.maven.apache.org/maven2/org/apache/maven/scm/maven-scm-provider-synergy/1.3/maven-scm-provider-synergy-1.3.jar
Downloaded: http://repo.maven.apache.org/maven2/org/netbeans/lib/cvsclient/20060125/cvsclient-20060125.jar (605 KB at 622.8 KB/sec)
Downloading: http://repo.maven.apache.org/maven2/org/apache/maven/scm/maven-scm-provider-vss/1.3/maven-scm-provider-vss-1.3.jar
Downloaded: http://repo.maven.apache.org/maven2/org/apache/maven/scm/maven-scm-provider-perforce/1.3/maven-scm-provider-perforce-1.3.jar (74 KB at 193.1 KB/sec)
Downloading: http://repo.maven.apache.org/maven2/org/apache/maven/scm/maven-scm-provider-tfs/1.3/maven-scm-provider-tfs-1.3.jar
Downloaded: http://repo.maven.apache.org/maven2/org/apache/maven/scm/maven-scm-provider-svnexe/1.3/maven-scm-provider-svnexe-1.3.jar (61 KB at 147.5 KB/sec)
Downloading: http://repo.maven.apache.org/maven2/org/apache/maven/scm/maven-scm-manager-plexus/1.3/maven-scm-manager-plexus-1.3.jar
Downloaded: http://repo.maven.apache.org/maven2/org/apache/maven/scm/maven-scm-provider-synergy/1.3/maven-scm-provider-synergy-1.3.jar (51 KB at 134.6 KB/sec)
Downloading: http://repo.maven.apache.org/maven2/org/apache/maven/scm/maven-scm-provider-svn-commons/1.3/maven-scm-provider-svn-commons-1.3.jar
Downloaded: http://repo.maven.apache.org/maven2/org/apache/maven/scm/maven-scm-provider-starteam/1.3/maven-scm-provider-starteam-1.3.jar (70 KB at 151.3 KB/sec)
Downloading: http://repo.maven.apache.org/maven2/jaxen/jaxen/1.1-beta-8/jaxen-1.1-beta-8.jar
Downloaded: http://repo.maven.apache.org/maven2/org/apache/maven/scm/maven-scm-provider-vss/1.3/maven-scm-provider-vss-1.3.jar (66 KB at 175.6 KB/sec)
Downloading: http://repo.maven.apache.org/maven2/jdom/jdom/1.0/jdom-1.0.jar
Downloaded: http://repo.maven.apache.org/maven2/org/apache/maven/scm/maven-scm-provider-tfs/1.3/maven-scm-provider-tfs-1.3.jar (38 KB at 101.4 KB/sec)
Downloading: http://repo.maven.apache.org/maven2/org/apache/maven/reporting/maven-reporting-api/2.0.9/maven-reporting-api-2.0.9.jar
Downloaded: http://repo.maven.apache.org/maven2/org/apache/maven/scm/maven-scm-provider-svn-commons/1.3/maven-scm-provider-svn-commons-1.3.jar (38 KB at 100.1 KB/sec)
Downloading: http://repo.maven.apache.org/maven2/org/apache/maven/doxia/doxia-sink-api/1.0-alpha-10/doxia-sink-api-1.0-alpha-10.jar
Downloaded: http://repo.maven.apache.org/maven2/org/apache/maven/scm/maven-scm-manager-plexus/1.3/maven-scm-manager-plexus-1.3.jar (11 KB at 26.0 KB/sec)
Downloading: http://repo.maven.apache.org/maven2/org/apache/maven/scm/maven-scm-api/1.3/maven-scm-api-1.3.jar
Downloaded: http://repo.maven.apache.org/maven2/jdom/jdom/1.0/jdom-1.0.jar (150 KB at 382.8 KB/sec)
Downloading: http://repo.maven.apache.org/maven2/org/codehaus/plexus/plexus-utils/1.5.6/plexus-utils-1.5.6.jar
Downloaded: http://repo.maven.apache.org/maven2/org/apache/maven/reporting/maven-reporting-api/2.0.9/maven-reporting-api-2.0.9.jar (10 KB at 27.9 KB/sec)
Downloading: http://repo.maven.apache.org/maven2/org/jdom/jdom/1.1/jdom-1.1.jar
Downloaded: http://repo.maven.apache.org/maven2/jaxen/jaxen/1.1-beta-8/jaxen-1.1-beta-8.jar (227 KB at 377.1 KB/sec)
Downloaded: http://repo.maven.apache.org/maven2/org/apache/maven/doxia/doxia-sink-api/1.0-alpha-10/doxia-sink-api-1.0-alpha-10.jar (10 KB at 26.7 KB/sec)
Downloaded: http://repo.maven.apache.org/maven2/org/apache/maven/scm/maven-scm-api/1.3/maven-scm-api-1.3.jar (88 KB at 211.0 KB/sec)
Downloaded: http://repo.maven.apache.org/maven2/org/codehaus/plexus/plexus-utils/1.5.6/plexus-utils-1.5.6.jar (245 KB at 592.4 KB/sec)
Downloaded: http://repo.maven.apache.org/maven2/org/jdom/jdom/1.1/jdom-1.1.jar (150 KB at 369.2 KB/sec)
[BFA] Scanning build for known causes...
[BFA] No failure causes found
[BFA] Done. 0s
[INFO] ------------------------------------------------------------------------
[INFO] Reactor Summary:
[INFO] 
[INFO] forget-me ......................................... FAILURE [35.400s]
[INFO] [GDPR] Forget Me - API ............................ SKIPPED
[INFO] [GDPR] Forget Me - Configurations ................. SKIPPED
[INFO] [GDPR] Forget Me - SQL Modules .................... SKIPPED
[INFO] [GDPR] Forget Me - Logs Modules ................... SKIPPED
[INFO] [GDPR] Forget Me - Tool ........................... SKIPPED
[INFO] ------------------------------------------------------------------------
[INFO] BUILD FAILURE
[INFO] ------------------------------------------------------------------------
[INFO] Total time: 55.661s
[INFO] Finished at: Wed Feb 14 15:52:51 UTC 2018
[INFO] Final Memory: 13M/142M
[INFO] ------------------------------------------------------------------------
Waiting for Jenkins to finish collecting data
[ERROR] Failed to execute goal org.apache.maven.plugins:maven-release-plugin:2.0:prepare (default-cli) on project forget-me: Missing required setting: scm connection or developerConnection must be specified. -> [Help 1]
[ERROR] 
[ERROR] To see the full stack trace of the errors, re-run Maven with the -e switch.
[ERROR] Re-run Maven using the -X switch to enable full debug logging.
[ERROR] 
[ERROR] For more information about the errors and possible solutions, please read the following articles:
[ERROR] [Help 1] http://cwiki.apache.org/confluence/display/MAVEN/MojoFailureException
[JENKINS] Archiving <https://wso2.org/jenkins/job/platform-builds/job/identity-anonymization-tool/ws/components/org.wso2.carbon.privacy.forgetme.sql/pom.xml> to org.wso2.carbon.privacy/org.wso2.carbon.privacy.forgetme.sql/1.0.0-SNAPSHOT/org.wso2.carbon.privacy.forgetme.sql-1.0.0-SNAPSHOT.pom
[JENKINS] Archiving <https://wso2.org/jenkins/job/platform-builds/job/identity-anonymization-tool/ws/components/org.wso2.carbon.privacy.forgetme.tool/pom.xml> to org.wso2.carbon.privacy/org.wso2.carbon.privacy.forgetme.tool/1.0.0-SNAPSHOT/org.wso2.carbon.privacy.forgetme.tool-1.0.0-SNAPSHOT.pom
[JENKINS] Archiving <https://wso2.org/jenkins/job/platform-builds/job/identity-anonymization-tool/ws/pom.xml> to org.wso2.carbon.privacy/forget-me/1.0.0-SNAPSHOT/forget-me-1.0.0-SNAPSHOT.pom
[JENKINS] Archiving <https://wso2.org/jenkins/job/platform-builds/job/identity-anonymization-tool/ws/components/org.wso2.carbon.privacy.forgetme.api/pom.xml> to org.wso2.carbon.privacy/org.wso2.carbon.privacy.forgetme.api/1.0.0-SNAPSHOT/org.wso2.carbon.privacy.forgetme.api-1.0.0-SNAPSHOT.pom
[JENKINS] Archiving <https://wso2.org/jenkins/job/platform-builds/job/identity-anonymization-tool/ws/components/org.wso2.carbon.privacy.forgetme.conf/pom.xml> to org.wso2.carbon.privacy/org.wso2.carbon.privacy.forgetme.conf/1.0.0-SNAPSHOT/org.wso2.carbon.privacy.forgetme.conf-1.0.0-SNAPSHOT.pom
[JENKINS] Archiving <https://wso2.org/jenkins/job/platform-builds/job/identity-anonymization-tool/ws/components/org.wso2.carbon.privacy.forgetme.logs/pom.xml> to org.wso2.carbon.privacy/org.wso2.carbon.privacy.forgetme.logs/1.0.0-SNAPSHOT/org.wso2.carbon.privacy.forgetme.logs-1.0.0-SNAPSHOT.pom
channel stopped
 > git rev-parse HEAD^{commit} # timeout=10
 > git rev-parse HEAD^{commit} # timeout=10
------------------------------------------------------------------------

[WSO2 Maven Release] [WSO2 Maven Release] Build Result: FAILURE
[WSO2 Maven Release] Dropping Git Tag: v1.0.0. Reason: FAILURE build.

[WSO2 Maven Release] Deleting release tag from remote.
 > git --version # timeout=10
using GIT_ASKPASS to set credentials github user for maven release plugin (CD)
 > git push https://github.com/wso2/identity-anonymization-tool.git :refs/tags/v1.0.0
[WSO2 Maven Release] Dropped git tag - v1.0.0
FATAL: [M2Release] Could not find nexus stage repository for project.

[BFA] Scanning build for known causes...
[BFA] Found failure cause(s):
[BFA] Unable to find nexus stage repo from category Release-Failure
[BFA] Done. 0s
Not sending mail to unregistered user JKAUSHALYA at users.noreply.github.com


More information about the Builder mailing list