[Builder] Build failed in Jenkins: products » product-sp » WSO2 Stream Processor - Parent #310

cbuilder at wso2.org cbuilder at wso2.org
Fri Jun 1 00:43:53 PDT 2018


See <http://54.169.129.84:8080/jenkins/job/products/job/product-sp/org.wso2.sp$org.wso2.carbon.sp.parent/310/display/redirect?page=changes>

Changes:

[suganyasuven] Add Function extension for filtering meaningful words

[suganyasuven] Add Extension for filtering meaningful words for word cloud widget

[merujajoseph] Add incomplete Twitter Analytics dashboard content

[sajithd] Remove the doc files as doc plugin automatically generated

[sajithd] Fix Twitter analytics feature install issues

[sajithd] Move source into new directory

[sajithd] Move source into new directory

[sajithd] Add FilerWords and Word Siddhi extensions into Twitter Solution

[rami.desilva] Add activity explorer feature which adhears to open tracing standard

[sajithd] Fix Twitter analytics Siddhi extensions dependency issue

[rami.desilva] Add activity explorer siddhi app instructions

------------------------------------------
[...truncated 668.29 KB...]
[INFO]     | +-- string-width at 1.0.2 
[INFO]     | | +-- code-point-at at 1.1.0 
[INFO]     | | `-- is-fullwidth-code-point at 1.0.0 
[INFO]     | `-- wrap-ansi at 2.1.0 
[INFO]     |   `-- string-width at 1.0.2 
[INFO]     +-- decamelize at 1.2.0 
[INFO]     +-- get-caller-file at 1.0.2 
[INFO]     +-- os-locale at 2.1.0 
[INFO]     | +-- execa at 0.7.0 
[INFO]     | | +-- cross-spawn at 5.1.0 
[INFO]     | | | +-- shebang-command at 1.2.0 
[INFO]     | | | | `-- shebang-regex at 1.0.0 
[INFO]     | | | `-- which at 1.3.1 
[INFO]     | | |   `-- isexe at 2.0.0 
[INFO]     | | +-- get-stream at 3.0.0 
[INFO]     | | +-- npm-run-path at 2.0.2 
[INFO]     | | | `-- path-key at 2.0.1 
[INFO]     | | +-- p-finally at 1.0.0 
[INFO]     | | +-- signal-exit at 3.0.2 
[INFO]     | | `-- strip-eof at 1.0.0 
[INFO]     | +-- lcid at 1.0.0 
[INFO]     | | `-- invert-kv at 1.0.0 
[INFO]     | `-- mem at 1.1.0 
[INFO]     |   `-- mimic-fn at 1.2.0 
[INFO]     +-- read-pkg-up at 2.0.0 
[INFO]     | `-- read-pkg at 2.0.0 
[INFO]     |   +-- load-json-file at 2.0.0 
[INFO]     |   | +-- parse-json at 2.2.0 
[INFO]     |   | +-- pify at 2.3.0 
[INFO]     |   | `-- strip-bom at 3.0.0 
[INFO]     |   +-- normalize-package-data at 2.4.0 
[INFO]     |   | +-- hosted-git-info at 2.6.0 
[INFO]     |   | +-- is-builtin-module at 1.0.0 
[INFO]     |   | | `-- builtin-modules at 1.1.1 
[INFO]     |   | `-- validate-npm-package-license at 3.0.3 
[INFO]     |   |   +-- spdx-correct at 3.0.0 
[INFO]     |   |   | `-- spdx-license-ids at 3.0.0 
[INFO]     |   |   `-- spdx-expression-parse at 3.0.0 
[INFO]     |   |     `-- spdx-exceptions at 2.1.0 
[INFO]     |   `-- path-type at 2.0.0 
[INFO]     |     `-- pify at 2.3.0 
[INFO]     +-- require-directory at 2.1.1 
[INFO]     +-- require-main-filename at 1.0.1 
[INFO]     +-- set-blocking at 2.0.0 
[INFO]     +-- string-width at 2.1.1 
[INFO]     | +-- is-fullwidth-code-point at 2.0.0 
[INFO]     | `-- strip-ansi at 4.0.0 
[INFO]     |   `-- ansi-regex at 3.0.0 
[INFO]     +-- which-module at 2.0.0 
[INFO]     +-- y18n at 3.2.1 
[INFO]     `-- yargs-parser at 7.0.0 
[INFO]       `-- camelcase at 4.1.0 
[INFO] 
[INFO] [INFO] 
[INFO] [INFO] --- maven-remote-resources-plugin:1.5:process (default) @ org.wso2.sp.solutions.widgets.http.analytics.response.code.filter ---
[INFO] [INFO] 
[INFO] [INFO] --- exec-maven-plugin:1.5.0:exec (npm run dev (compile)) @ org.wso2.sp.solutions.widgets.http.analytics.response.code.filter ---
[INFO] 
[INFO] > http-analytics-response-code-filter at 0.1.0 build <http://54.169.129.84:8080/jenkins/job/products/job/product-sp/org.wso2.sp$org.wso2.carbon.sp.parent/ws/modules/solutions/http-analytics/widgets/HTTPAnalyticsResponseCodeFilter>
[INFO] > webpack -p --config webpack.config.js
[INFO] 
[INFO] Hash: 61efbe0fc8aa69d5d5f4
[INFO] Version: webpack 3.12.0
[INFO] Time: 6746ms
[INFO]                              Asset       Size  Chunks                    Chunk Names
[INFO] HTTPAnalyticsResponseCodeFilter.js     434 kB       0  [emitted]  [big]  index
[INFO]              dataProviderConf.json    1.47 kB          [emitted]         
[INFO]                    widgetConf.json  202 bytes          [emitted]         
[INFO]  [115] ./HTTPAnalyticsResponseCodeFilter.jsx 23.3 kB {0} [built]
[INFO]  [317] ./utils/WidgetChannelManager.js 5.45 kB {0} [built]
[INFO]  [318] ./resources/dataProviderConf.json 1.46 kB {0} [built]
[INFO]     + 330 hidden modules
[INFO] [INFO] 
[INFO] [INFO] >>> findbugs-maven-plugin:3.0.3:check (analyze-compile) @ org.wso2.sp.solutions.widgets.http.analytics.response.code.filter >>>
[INFO] [INFO] 
[INFO] [INFO] --- findbugs-maven-plugin:3.0.3:findbugs (findbugs) @ org.wso2.sp.solutions.widgets.http.analytics.response.code.filter ---
[INFO] [INFO] 
[INFO] [INFO] <<< findbugs-maven-plugin:3.0.3:check (analyze-compile) @ org.wso2.sp.solutions.widgets.http.analytics.response.code.filter <<<
[INFO] [INFO] 
[INFO] [INFO] --- findbugs-maven-plugin:3.0.3:check (analyze-compile) @ org.wso2.sp.solutions.widgets.http.analytics.response.code.filter ---
[INFO] [INFO] 
[INFO] [INFO] --- maven-assembly-plugin:2.6:single (source-release-assembly) @ org.wso2.sp.solutions.widgets.http.analytics.response.code.filter ---
[INFO] [INFO] Skipping the assembly in this project because it's not the Execution Root
[INFO] [INFO] 
[INFO] [INFO] --- maven-assembly-plugin:2.6:single (default) @ org.wso2.sp.solutions.widgets.http.analytics.response.code.filter ---
[INFO] [INFO] Reading assembly descriptor: <http://54.169.129.84:8080/jenkins/job/products/job/product-sp/org.wso2.sp$org.wso2.carbon.sp.parent/ws/modules/solutions/http-analytics/widgets/HTTPAnalyticsResponseCodeFilter/../assembly.xml>
[INFO] [INFO] Building zip: <http://54.169.129.84:8080/jenkins/job/products/job/product-sp/org.wso2.sp$org.wso2.carbon.sp.parent/ws/modules/solutions/http-analytics/widgets/HTTPAnalyticsResponseCodeFilter/target/org.wso2.sp.solutions.widgets.http.analytics.response.code.filter-4.2.0-SNAPSHOT.zip>
[INFO] [INFO] 
[INFO] [INFO] >>> maven-source-plugin:3.0.0:jar (attach-sources) @ org.wso2.sp.solutions.widgets.http.analytics.response.code.filter >>>
[INFO] [INFO] 
[INFO] [INFO] --- maven-checkstyle-plugin:2.17:check (validate) @ org.wso2.sp.solutions.widgets.http.analytics.response.code.filter ---
[INFO] [INFO] Starting audit...
[INFO] Audit done.
[INFO] [INFO] 
[INFO] [INFO] --- buildnumber-maven-plugin:1.4:create (default) @ org.wso2.sp.solutions.widgets.http.analytics.response.code.filter ---
[INFO] [INFO] Executing: /bin/sh -c cd '<http://54.169.129.84:8080/jenkins/job/products/job/product-sp/org.wso2.sp$org.wso2.carbon.sp.parent/ws/modules/solutions/http-analytics/widgets/HTTPAnalyticsResponseCodeFilter'> && 'git' 'rev-parse' '--verify' 'HEAD'
[INFO] [INFO] Working directory: <http://54.169.129.84:8080/jenkins/job/products/job/product-sp/org.wso2.sp$org.wso2.carbon.sp.parent/ws/modules/solutions/http-analytics/widgets/HTTPAnalyticsResponseCodeFilter>
[INFO] [INFO] Storing buildNumber: da397624e4455ac541e8d6695dcdbff34f6ad736 at timestamp: 1527838994029
[INFO] [INFO] Storing buildScmBranch: release-4.2.0-alpha-l63
[INFO] [INFO] 
[INFO] [INFO] --- exec-maven-plugin:1.5.0:exec (npm install (initialize)) @ org.wso2.sp.solutions.widgets.http.analytics.response.code.filter ---
[INFO] npm WARN optional SKIPPING OPTIONAL DEPENDENCY: fsevents@^1.1.2 (node_modules/chokidar/node_modules/fsevents):
[INFO] npm WARN notsup SKIPPING OPTIONAL DEPENDENCY: Unsupported platform for fsevents at 1.2.4: wanted {"os":"darwin","arch":"any"} (current: {"os":"linux","arch":"x64"})
[INFO] [INFO] 
[INFO] [INFO] <<< maven-source-plugin:3.0.0:jar (attach-sources) @ org.wso2.sp.solutions.widgets.http.analytics.response.code.filter <<<
[INFO] [INFO] 
[INFO] [INFO] --- maven-source-plugin:3.0.0:jar (attach-sources) @ org.wso2.sp.solutions.widgets.http.analytics.response.code.filter ---
[INFO] [INFO] 
[INFO] [INFO] --- maven-javadoc-plugin:2.10.3:jar (attach-javadocs) @ org.wso2.sp.solutions.widgets.http.analytics.response.code.filter ---
[INFO] [INFO] Not executing Javadoc as the project is not a Java classpath-capable package
[INFO] [INFO] 
[INFO] [INFO] --- maven-gpg-plugin:1.6:sign (default) @ org.wso2.sp.solutions.widgets.http.analytics.response.code.filter ---
[INFO] gpg: WARNING: unsafe ownership on homedir `/build/gpg-keys/.gnupg'
[INFO] gpg: WARNING: unsafe ownership on homedir `/build/gpg-keys/.gnupg'
[INFO] [INFO] 
[INFO] [INFO] --- maven-install-plugin:2.5.2:install (default-install) @ org.wso2.sp.solutions.widgets.http.analytics.response.code.filter ---
[INFO] [INFO] Installing <http://54.169.129.84:8080/jenkins/job/products/job/product-sp/org.wso2.sp$org.wso2.carbon.sp.parent/ws/modules/solutions/http-analytics/widgets/HTTPAnalyticsResponseCodeFilter/pom.xml> to <http://54.169.129.84:8080/jenkins/job/products/job/product-sp/org.wso2.sp$org.wso2.carbon.sp.parent/ws/.repository/org/wso2/sp/org.wso2.sp.solutions.widgets.http.analytics.response.code.filter/4.2.0-SNAPSHOT/org.wso2.sp.solutions.widgets.http.analytics.response.code.filter-4.2.0-SNAPSHOT.pom>
[INFO] [INFO] Installing <http://54.169.129.84:8080/jenkins/job/products/job/product-sp/org.wso2.sp$org.wso2.carbon.sp.parent/ws/modules/solutions/http-analytics/widgets/HTTPAnalyticsResponseCodeFilter/target/org.wso2.sp.solutions.widgets.http.analytics.response.code.filter-4.2.0-SNAPSHOT.zip> to <http://54.169.129.84:8080/jenkins/job/products/job/product-sp/org.wso2.sp$org.wso2.carbon.sp.parent/ws/.repository/org/wso2/sp/org.wso2.sp.solutions.widgets.http.analytics.response.code.filter/4.2.0-SNAPSHOT/org.wso2.sp.solutions.widgets.http.analytics.response.code.filter-4.2.0-SNAPSHOT.zip>
[INFO] [INFO] Installing <http://54.169.129.84:8080/jenkins/job/products/job/product-sp/org.wso2.sp$org.wso2.carbon.sp.parent/ws/modules/solutions/http-analytics/widgets/HTTPAnalyticsResponseCodeFilter/target/org.wso2.sp.solutions.widgets.http.analytics.response.code.filter-4.2.0-SNAPSHOT.pom.asc> to <http://54.169.129.84:8080/jenkins/job/products/job/product-sp/org.wso2.sp$org.wso2.carbon.sp.parent/ws/.repository/org/wso2/sp/org.wso2.sp.solutions.widgets.http.analytics.response.code.filter/4.2.0-SNAPSHOT/org.wso2.sp.solutions.widgets.http.analytics.response.code.filter-4.2.0-SNAPSHOT.pom.asc>
[INFO] [INFO] Installing <http://54.169.129.84:8080/jenkins/job/products/job/product-sp/org.wso2.sp$org.wso2.carbon.sp.parent/ws/modules/solutions/http-analytics/widgets/HTTPAnalyticsResponseCodeFilter/target/org.wso2.sp.solutions.widgets.http.analytics.response.code.filter-4.2.0-SNAPSHOT.zip.asc> to <http://54.169.129.84:8080/jenkins/job/products/job/product-sp/org.wso2.sp$org.wso2.carbon.sp.parent/ws/.repository/org/wso2/sp/org.wso2.sp.solutions.widgets.http.analytics.response.code.filter/4.2.0-SNAPSHOT/org.wso2.sp.solutions.widgets.http.analytics.response.code.filter-4.2.0-SNAPSHOT.zip.asc>
[INFO] [INFO]                                                                         
[INFO] [INFO] ------------------------------------------------------------------------
[INFO] [INFO] Building WSO2 Stream Processor - Solutions - HTTP Analytics - Feature 4.2.0-SNAPSHOT
[INFO] [INFO] ------------------------------------------------------------------------
[INFO] Downloading: http://maven.wso2.org/nexus/content/repositories/releases/org/apache/maven/plugins/maven-dependency-plugin/2.10/maven-dependency-plugin-2.10.pom
[INFO] Downloading: http://maven.wso2.org/nexus/content/groups/wso2-public/org/apache/maven/plugins/maven-dependency-plugin/2.10/maven-dependency-plugin-2.10.pom
[INFO] Downloaded: http://maven.wso2.org/nexus/content/groups/wso2-public/org/apache/maven/plugins/maven-dependency-plugin/2.10/maven-dependency-plugin-2.10.pom (12 KB at 2341.8 KB/sec)
[INFO] Downloading: http://maven.wso2.org/nexus/content/repositories/releases/org/apache/maven/plugins/maven-dependency-plugin/2.10/maven-dependency-plugin-2.10.jar
[INFO] Downloading: http://maven.wso2.org/nexus/content/groups/wso2-public/org/apache/maven/plugins/maven-dependency-plugin/2.10/maven-dependency-plugin-2.10.jar
[INFO] Downloaded: http://maven.wso2.org/nexus/content/groups/wso2-public/org/apache/maven/plugins/maven-dependency-plugin/2.10/maven-dependency-plugin-2.10.jar (157 KB at 26031.4 KB/sec)
[INFO] [INFO] 
[INFO] [INFO] --- maven-clean-plugin:3.0.0:clean (default-clean) @ org.wso2.sp.solutions.http.analytics.feature ---
[INFO] [INFO] 
[INFO] [INFO] --- maven-checkstyle-plugin:2.17:check (validate) @ org.wso2.sp.solutions.http.analytics.feature ---
[INFO] [INFO] Starting audit...
[INFO] Audit done.
[INFO] [INFO] 
[INFO] [INFO] --- buildnumber-maven-plugin:1.4:create (default) @ org.wso2.sp.solutions.http.analytics.feature ---
[INFO] [INFO] Executing: /bin/sh -c cd '<http://54.169.129.84:8080/jenkins/job/products/job/product-sp/org.wso2.sp$org.wso2.carbon.sp.parent/ws/modules/solutions/http-analytics/features/org.wso2.sp.solutions.http.analytics.feature'> && 'git' 'rev-parse' '--verify' 'HEAD'
[INFO] [INFO] Working directory: <http://54.169.129.84:8080/jenkins/job/products/job/product-sp/org.wso2.sp$org.wso2.carbon.sp.parent/ws/modules/solutions/http-analytics/features/org.wso2.sp.solutions.http.analytics.feature>
[INFO] [INFO] Storing buildNumber: da397624e4455ac541e8d6695dcdbff34f6ad736 at timestamp: 1527838998119
[INFO] [INFO] Storing buildScmBranch: release-4.2.0-alpha-l63
[INFO] [INFO] 
[INFO] [INFO] --- maven-remote-resources-plugin:1.5:process (default) @ org.wso2.sp.solutions.http.analytics.feature ---
[INFO] [INFO] 
[INFO] [INFO] >>> findbugs-maven-plugin:3.0.3:check (analyze-compile) @ org.wso2.sp.solutions.http.analytics.feature >>>
[INFO] [INFO] 
[INFO] [INFO] --- findbugs-maven-plugin:3.0.3:findbugs (findbugs) @ org.wso2.sp.solutions.http.analytics.feature ---
[INFO] [INFO] 
[INFO] [INFO] <<< findbugs-maven-plugin:3.0.3:check (analyze-compile) @ org.wso2.sp.solutions.http.analytics.feature <<<
[INFO] [INFO] 
[INFO] [INFO] --- findbugs-maven-plugin:3.0.3:check (analyze-compile) @ org.wso2.sp.solutions.http.analytics.feature ---
[INFO] [INFO] 
[INFO] [INFO] --- maven-assembly-plugin:2.6:single (source-release-assembly) @ org.wso2.sp.solutions.http.analytics.feature ---
[INFO] [INFO] Skipping the assembly in this project because it's not the Execution Root
[INFO] [INFO] 
[INFO] [INFO] >>> maven-source-plugin:3.0.0:jar (attach-sources) @ org.wso2.sp.solutions.http.analytics.feature >>>
[INFO] [INFO] 
[INFO] [INFO] --- maven-checkstyle-plugin:2.17:check (validate) @ org.wso2.sp.solutions.http.analytics.feature ---
[INFO] [INFO] Starting audit...
[INFO] Audit done.
[INFO] [INFO] 
[INFO] [INFO] --- buildnumber-maven-plugin:1.4:create (default) @ org.wso2.sp.solutions.http.analytics.feature ---
[INFO] [INFO] Executing: /bin/sh -c cd '<http://54.169.129.84:8080/jenkins/job/products/job/product-sp/org.wso2.sp$org.wso2.carbon.sp.parent/ws/modules/solutions/http-analytics/features/org.wso2.sp.solutions.http.analytics.feature'> && 'git' 'rev-parse' '--verify' 'HEAD'
[INFO] [INFO] Working directory: <http://54.169.129.84:8080/jenkins/job/products/job/product-sp/org.wso2.sp$org.wso2.carbon.sp.parent/ws/modules/solutions/http-analytics/features/org.wso2.sp.solutions.http.analytics.feature>
[INFO] [INFO] Storing buildNumber: da397624e4455ac541e8d6695dcdbff34f6ad736 at timestamp: 1527838998881
[INFO] [INFO] Storing buildScmBranch: release-4.2.0-alpha-l63
[INFO] [INFO] 
[INFO] [INFO] <<< maven-source-plugin:3.0.0:jar (attach-sources) @ org.wso2.sp.solutions.http.analytics.feature <<<
[INFO] [INFO] 
[INFO] [INFO] --- maven-source-plugin:3.0.0:jar (attach-sources) @ org.wso2.sp.solutions.http.analytics.feature ---
[INFO] [INFO] Building jar: <http://54.169.129.84:8080/jenkins/job/products/job/product-sp/org.wso2.sp$org.wso2.carbon.sp.parent/ws/modules/solutions/http-analytics/features/org.wso2.sp.solutions.http.analytics.feature/target/org.wso2.sp.solutions.http.analytics.feature-4.2.0-SNAPSHOT-sources.jar>
[INFO] [INFO] ------------------------------------------------------------------------
[INFO] [INFO] Reactor Summary:
[INFO] [INFO] 
[INFO] [INFO] WSO2 Stream Processor - Parent .................... SUCCESS [13.236s]
[INFO] [INFO] WSO2 Stream Processor - Solutions ................. SUCCESS [0.463s]
[INFO] [INFO] WSO2 Stream Processor - HTTP Analytics ............ SUCCESS [0.456s]
[INFO] [INFO] WSO2 Stream Processor - HTTP Analytics Widgets .... SUCCESS [0.428s]
[INFO] [INFO] WSO2 Stream Processor - Solutions - Widgets - HTTP Analytics - Latency Comparison  SUCCESS [1:22.809s]
[INFO] [INFO] WSO2 Stream Processor - Solutions - Widgets - HTTP Analytics - Latency Over Time  SUCCESS [1:13.279s]
[INFO] [INFO] WSO2 Stream Processor - Solutions - Widgets - HTTP Analytics - Request Count Comparison  SUCCESS [1:09.002s]
[INFO] [INFO] WSO2 Stream Processor - Solutions - Widgets - HTTP Analytics - Request Count Over Time  SUCCESS [1:04.471s]
[INFO] [INFO] WSO2 Stream Processor - Solutions - Widgets - HTTP Analytics - Request Statistics  SUCCESS [1:13.119s]
[INFO] [INFO] WSO2 Stream Processor - Solutions - Widgets - HTTP Analytics - Request Count Filter  SUCCESS [47.478s]
[INFO] [INFO] WSO2 Stream Processor - Solutions - Widgets - HTTP Analytics - Response Code Filter  SUCCESS [44.337s]
[INFO] [INFO] WSO2 Stream Processor - Solutions - HTTP Analytics - Feature  FAILURE [1.703s]
[INFO] [INFO] WSO2 Stream Processor - Twitter Analytics ......... SKIPPED
[INFO] [INFO] WSO2 Stream Processor - Solution - Widgets - Emotions  SKIPPED
[INFO] [INFO] WSO2 Stream Processor - Solution - Widgets - EmotionsAnalysis  SKIPPED
[INFO] [INFO] WSO2 Stream Processor - Solution - Widgets - Hashtags  SKIPPED
[INFO] [INFO] WSO2 Stream Processor - Solution - Widgets - LiveTweets  SKIPPED
[INFO] [INFO] WSO2 Stream Processor - Solution - Widgets - PopularTweets  SKIPPED
[INFO] [INFO] WSO2 Stream Processor - Solution - Widgets - TopCountries  SKIPPED
[INFO] [INFO] WSO2 Stream Processor - Solution - Widgets - TopSentiment  SKIPPED
[INFO] [INFO] WSO2 Stream Processor - Solution - Widgets - TweetCountAnalysis  SKIPPED
[INFO] [INFO] WSO2 Carbon Dashboards - Samples - Widgets - TweetCounter  SKIPPED
[INFO] [INFO] WSO2 Stream Processor - Solution - Widgets - WordCloud  SKIPPED
[INFO] [INFO] WSO2 Stream Processor - Portal Dashboard Twitter Analytics Feature  SKIPPED
[INFO] [INFO] WSO2 Stream Processor - Activity Explorer ......... SKIPPED
[INFO] [INFO] WSO2 Stream Processor - Activity Explorer ......... SKIPPED
[INFO] [INFO] WSO2 Carbon Dashboards - Samples - Widgets - Open tracing Event  SKIPPED
[INFO] [INFO] WSO2 Carbon Dashboards - Samples - Widgets - Open tracing List  SKIPPED
[INFO] [INFO] WSO2 Carbon Dashboards - Samples - Widgets - Opentracing Search  SKIPPED
[INFO] [INFO] WSO2 Carbon Dashboards - Samples - Widgets - Open Tracing Vis Timeline  SKIPPED
[INFO] [INFO] WSO2 Stream Processor - Portal Dashboard Activity Explorer Feature  SKIPPED
[INFO] [INFO] WSO2 Stream Processor - Siddhi Execution Country .. SKIPPED
[INFO] [INFO] WSO2 Stream Processor - Siddhi Execution Tokenizer  SKIPPED
[INFO] [INFO] WSO2 Stream Processor - Siddhi Execution Word ..... SKIPPED
[INFO] [INFO] WSO2 Stream Processor - Siddhi Execution Filter Words  SKIPPED
[INFO] [INFO] WSO2 Stream Processor - Distribution .............. SKIPPED
[INFO] [INFO] WSO2 Stream Processor - Tests ..................... SKIPPED
[INFO] [INFO] WSO2 Stream Processor - Sample Clients ............ SKIPPED
[INFO] [INFO] WSO2 Stream Processor - Sample - Kafka Consumer ... SKIPPED
[INFO] [INFO] WSO2 Stream Processor - Sample - Kafka Producer ... SKIPPED
[INFO] [INFO] WSO2 Stream Processor - Sample - TCP Client ....... SKIPPED
[INFO] [INFO] WSO2 Stream Processor - Sample - TCP Server ....... SKIPPED
[INFO] [INFO] WSO2 Stream Processor - Sample - HTTP Server ...... SKIPPED
[INFO] [INFO] WSO2 Stream Processor - Sample - HTTP Client ...... SKIPPED
[INFO] [INFO] WSO2 Stream Processor - Sample - WSO2Event Client . SKIPPED
[INFO] [INFO] WSO2 Stream Processor - Sample - WSO2Event Server . SKIPPED
[INFO] [INFO] WSO2 Stream Processor - Sample - MQTT Client ...... SKIPPED
[INFO] [INFO] WSO2 Stream Processor - Sample - Mqtt Consumer .... SKIPPED
[INFO] [INFO] WSO2 Stream Processor - Sample - RabbitMQ Consumer  SKIPPED
[INFO] [INFO] WSO2 Stream Processor - Sample - RabbitMQ Producer  SKIPPED
[INFO] [INFO] WSO2 Stream Processor - Sample - Kafka Producer ... SKIPPED
[INFO] [INFO] WSO2 Stream Processor - Sample - JMS Consumer ..... SKIPPED
[INFO] [INFO] WSO2 Stream Processor - Sample - WebSocket Client . SKIPPED
[INFO] [INFO] WSO2 Stream Processor - Sample - WebSocket Consumer  SKIPPED
[INFO] [INFO] WSO2 Stream Processor - Integration Tests ......... SKIPPED
[INFO] [INFO] WSO2 Stream Processor - Performance ............... SKIPPED
[INFO] [INFO] WSO2 Stream Processor - Twitter Analytics ......... SKIPPED
[INFO] [INFO] ------------------------------------------------------------------------
[INFO] [INFO] BUILD FAILURE
[INFO] [INFO] ------------------------------------------------------------------------
[INFO] [INFO] Total time: 7:52.291s
[INFO] [INFO] Finished at: Fri Jun 01 07:43:18 UTC 2018
[INFO] [INFO] Final Memory: 56M/430M
[INFO] [INFO] ------------------------------------------------------------------------
[INFO] [ERROR] Failed to execute goal org.apache.maven.plugins:maven-source-plugin:3.0.0:jar (attach-sources) on project org.wso2.sp.solutions.http.analytics.feature: Error creating source archive: A zip file cannot include itself -> [Help 1]
[INFO] [ERROR] 
[INFO] [ERROR] To see the full stack trace of the errors, re-run Maven with the -e switch.
[INFO] [ERROR] Re-run Maven using the -X switch to enable full debug logging.
[INFO] [ERROR] 
[INFO] [ERROR] For more information about the errors and possible solutions, please read the following articles:
[INFO] [ERROR] [Help 1] http://cwiki.apache.org/confluence/display/MAVEN/MojoExecutionException
[INFO] [ERROR] 
[INFO] [ERROR] After correcting the problems, you can resume the build with the command
[INFO] [ERROR]   mvn <goals> -rf :org.wso2.sp.solutions.http.analytics.feature


More information about the Builder mailing list