[Builder] Build failed in Jenkins: product-microgateway #16

cbuilder at wso2.org cbuilder at wso2.org
Wed Jun 13 05:01:15 PDT 2018


See <http://54.169.129.84:8080/jenkins/job/product-microgateway/16/display/redirect?page=changes>

Changes:

[Malintha Amarasinghe] Refactoring pom versions and scripts

[harsz89] move variable strings to constants

[harsz89] add licence header

------------------------------------------
[...truncated 581.83 KB...]
[INFO] [INFO] Downloading: http://maven.wso2.org/nexus/content/groups/wso2-public/org/objenesis/objenesis-parent/2.5.1/objenesis-parent-2.5.1.pom
[INFO] [INFO] Downloaded: http://maven.wso2.org/nexus/content/groups/wso2-public/org/objenesis/objenesis-parent/2.5.1/objenesis-parent-2.5.1.pom (17 KB at 4033.9 KB/sec)
[INFO] [INFO] Downloading: http://maven.wso2.org/nexus/content/repositories/releases/com/google/guava/guava/23.0/guava-23.0.jar
[INFO] [INFO] Downloading: http://maven.wso2.org/nexus/content/repositories/releases/com/google/errorprone/error_prone_annotations/2.0.18/error_prone_annotations-2.0.18.jar
[INFO] [INFO] Downloading: http://maven.wso2.org/nexus/content/repositories/releases/com/google/j2objc/j2objc-annotations/1.1/j2objc-annotations-1.1.jar
[INFO] [INFO] Downloading: http://maven.wso2.org/nexus/content/repositories/releases/org/codehaus/mojo/animal-sniffer-annotations/1.14/animal-sniffer-annotations-1.14.jar
[INFO] [INFO] Downloading: http://maven.wso2.org/nexus/content/repositories/releases/org/ballerinalang/ballerina-http/0.974.0/ballerina-http-0.974.0.jar
[INFO] [INFO] Downloading: http://maven.wso2.org/nexus/content/repositories/releases/org/slf4j/slf4j-jdk14/1.7.22/slf4j-jdk14-1.7.22.jar
[INFO] [INFO] Downloading: http://maven.wso2.org/nexus/content/repositories/releases/org/apache/mina/mina-core/2.0.16/mina-core-2.0.16.jar
[INFO] [INFO] Downloading: http://maven.wso2.org/nexus/content/repositories/releases/org/awaitility/awaitility/3.0.0/awaitility-3.0.0.jar
[INFO] [INFO] Downloading: http://maven.wso2.org/nexus/content/repositories/releases/org/hamcrest/hamcrest-library/1.3/hamcrest-library-1.3.jar
[INFO] [INFO] Downloaded: http://maven.wso2.org/nexus/content/repositories/releases/org/ballerinalang/ballerina-http/0.974.0/ballerina-http-0.974.0.jar (403 KB at 57468.6 KB/sec)
[INFO] [INFO] Downloading: http://maven.wso2.org/nexus/content/repositories/releases/org/objenesis/objenesis/2.5.1/objenesis-2.5.1.jar
[INFO] [INFO] Downloading: http://maven.wso2.org/nexus/content/groups/wso2-public/com/google/guava/guava/23.0/guava-23.0.jar
[INFO] [INFO] Downloading: http://maven.wso2.org/nexus/content/groups/wso2-public/com/google/errorprone/error_prone_annotations/2.0.18/error_prone_annotations-2.0.18.jar
[INFO] [INFO] Downloading: http://maven.wso2.org/nexus/content/groups/wso2-public/com/google/j2objc/j2objc-annotations/1.1/j2objc-annotations-1.1.jar
[INFO] [INFO] Downloading: http://maven.wso2.org/nexus/content/groups/wso2-public/org/codehaus/mojo/animal-sniffer-annotations/1.14/animal-sniffer-annotations-1.14.jar
[INFO] [INFO] Downloading: http://maven.wso2.org/nexus/content/groups/wso2-public/org/slf4j/slf4j-jdk14/1.7.22/slf4j-jdk14-1.7.22.jar
[INFO] [INFO] Downloaded: http://maven.wso2.org/nexus/content/groups/wso2-public/org/slf4j/slf4j-jdk14/1.7.22/slf4j-jdk14-1.7.22.jar (9 KB at 2065.7 KB/sec)
[INFO] [INFO] Downloading: http://maven.wso2.org/nexus/content/groups/wso2-public/org/apache/mina/mina-core/2.0.16/mina-core-2.0.16.jar
[INFO] [INFO] Downloaded: http://maven.wso2.org/nexus/content/groups/wso2-public/com/google/j2objc/j2objc-annotations/1.1/j2objc-annotations-1.1.jar (9 KB at 1715.2 KB/sec)
[INFO] [INFO] Downloaded: http://maven.wso2.org/nexus/content/groups/wso2-public/com/google/errorprone/error_prone_annotations/2.0.18/error_prone_annotations-2.0.18.jar (12 KB at 2359.0 KB/sec)
[INFO] [INFO] Downloading: http://maven.wso2.org/nexus/content/groups/wso2-public/org/hamcrest/hamcrest-library/1.3/hamcrest-library-1.3.jar
[INFO] [INFO] Downloading: http://maven.wso2.org/nexus/content/groups/wso2-public/org/awaitility/awaitility/3.0.0/awaitility-3.0.0.jar
[INFO] [INFO] Downloaded: http://maven.wso2.org/nexus/content/groups/wso2-public/org/codehaus/mojo/animal-sniffer-annotations/1.14/animal-sniffer-annotations-1.14.jar (4 KB at 425.0 KB/sec)
[INFO] [INFO] Downloading: http://maven.wso2.org/nexus/content/groups/wso2-public/org/objenesis/objenesis/2.5.1/objenesis-2.5.1.jar
[INFO] [INFO] Downloaded: http://maven.wso2.org/nexus/content/groups/wso2-public/org/hamcrest/hamcrest-library/1.3/hamcrest-library-1.3.jar (52 KB at 4711.5 KB/sec)
[INFO] [INFO] Downloaded: http://maven.wso2.org/nexus/content/groups/wso2-public/org/awaitility/awaitility/3.0.0/awaitility-3.0.0.jar (91 KB at 6963.3 KB/sec)
[INFO] [INFO] Downloaded: http://maven.wso2.org/nexus/content/groups/wso2-public/com/google/guava/guava/23.0/guava-23.0.jar (2554 KB at 170228.4 KB/sec)
[INFO] [INFO] Downloaded: http://maven.wso2.org/nexus/content/groups/wso2-public/org/objenesis/objenesis/2.5.1/objenesis-2.5.1.jar (54 KB at 3794.0 KB/sec)
[INFO] [INFO] Downloaded: http://maven.wso2.org/nexus/content/groups/wso2-public/org/apache/mina/mina-core/2.0.16/mina-core-2.0.16.jar (637 KB at 39754.6 KB/sec)
[INFO] [INFO] 
[INFO] [INFO] --- maven-clean-plugin:2.5:clean (default-clean) @ test-integration ---
[INFO] [INFO] 
[INFO] [INFO] --- maven-dependency-plugin:2.8:unpack-dependencies (unpack-dependencies) @ test-integration ---
[INFO] [INFO] Unpacking <http://54.169.129.84:8080/jenkins/job/product-microgateway/ws/.repository/org/ballerinalang/ballerina-builtin/0.974.0/ballerina-builtin-0.974.0-ballerina-binary-repo.zip> to <http://54.169.129.84:8080/jenkins/job/product-microgateway/ws/tests/target/lib> with includes "" and excludes ""
[INFO] [INFO] Unpacking <http://54.169.129.84:8080/jenkins/job/product-microgateway/ws/.repository/org/ballerinalang/ballerina-mime/0.974.0/ballerina-mime-0.974.0-ballerina-binary-repo.zip> to <http://54.169.129.84:8080/jenkins/job/product-microgateway/ws/tests/target/lib> with includes "" and excludes ""
[INFO] [INFO] 
[INFO] [INFO] --- maven-resources-plugin:2.7:resources (default-resources) @ test-integration ---
[INFO] [WARNING] Using platform encoding (ANSI_X3.4-1968 actually) to copy filtered resources, i.e. build is platform dependent!
[INFO] [INFO] skip non existing resourceDirectory <http://54.169.129.84:8080/jenkins/job/product-microgateway/ws/tests/src/main/resources>
[INFO] [INFO] 
[INFO] [INFO] --- maven-compiler-plugin:3.5.1:compile (default-compile) @ test-integration ---
[INFO] [INFO] No sources to compile
[INFO] [INFO] 
[INFO] [INFO] --- maven-resources-plugin:2.7:testResources (default-testResources) @ test-integration ---
[INFO] [WARNING] Using platform encoding (ANSI_X3.4-1968 actually) to copy filtered resources, i.e. build is platform dependent!
[INFO] [INFO] Copying 10 resources
[INFO] [INFO] 
[INFO] [INFO] --- maven-compiler-plugin:3.5.1:testCompile (default-testCompile) @ test-integration ---
[INFO] [INFO] Changes detected - recompiling the module!
[INFO] [WARNING] File encoding has not been set, using platform encoding ANSI_X3.4-1968, i.e. build is platform dependent!
[INFO] [INFO] Compiling 15 source files to <http://54.169.129.84:8080/jenkins/job/product-microgateway/ws/tests/target/test-classes>
[INFO] SLF4J: Class path contains multiple SLF4J bindings.
[INFO] SLF4J: Found binding in [jar:<http://54.169.129.84:8080/jenkins/job/product-microgateway/ws/.repository/org/slf4j/slf4j-log4j12/1.7.5/slf4j-log4j12-1.7.5.jar!/org/slf4j/impl/StaticLoggerBinder.class]>
[INFO] SLF4J: Found binding in [jar:<http://54.169.129.84:8080/jenkins/job/product-microgateway/ws/.repository/org/slf4j/slf4j-simple/1.7.22/slf4j-simple-1.7.22.jar!/org/slf4j/impl/StaticLoggerBinder.class]>
[INFO] SLF4J: Found binding in [jar:<http://54.169.129.84:8080/jenkins/job/product-microgateway/ws/.repository/org/slf4j/slf4j-jdk14/1.7.22/slf4j-jdk14-1.7.22.jar!/org/slf4j/impl/StaticLoggerBinder.class]>
[INFO] SLF4J: See http://www.slf4j.org/codes.html#multiple_bindings for an explanation.
[INFO] SLF4J: Actual binding is of type [org.slf4j.impl.Log4jLoggerFactory]
[INFO] [INFO] <http://54.169.129.84:8080/jenkins/job/product-microgateway/ws/tests/src/test/java/org/wso2/micro/gateway/tests/util/HttpsClientRequest.java>: Some input files use unchecked or unsafe operations.
[INFO] [INFO] <http://54.169.129.84:8080/jenkins/job/product-microgateway/ws/tests/src/test/java/org/wso2/micro/gateway/tests/util/HttpsClientRequest.java>: Recompile with -Xlint:unchecked for details.
[INFO] [INFO] 
[INFO] [INFO] --- maven-surefire-plugin:2.19.1:test (default-test) @ test-integration ---
[INFO] 
[INFO] -------------------------------------------------------
[INFO]  T E S T S
[INFO] -------------------------------------------------------
[INFO] Running TestSuite
[INFO] SLF4J: Class path contains multiple SLF4J bindings.
[INFO] SLF4J: Found binding in [jar:<http://54.169.129.84:8080/jenkins/job/product-microgateway/ws/.repository/org/slf4j/slf4j-log4j12/1.7.5/slf4j-log4j12-1.7.5.jar!/org/slf4j/impl/StaticLoggerBinder.class]>
[INFO] SLF4J: Found binding in [jar:<http://54.169.129.84:8080/jenkins/job/product-microgateway/ws/.repository/org/slf4j/slf4j-simple/1.7.22/slf4j-simple-1.7.22.jar!/org/slf4j/impl/StaticLoggerBinder.class]>
[INFO] SLF4J: Found binding in [jar:<http://54.169.129.84:8080/jenkins/job/product-microgateway/ws/.repository/org/slf4j/slf4j-jdk14/1.7.22/slf4j-jdk14-1.7.22.jar!/org/slf4j/impl/StaticLoggerBinder.class]>
[INFO] SLF4J: See http://www.slf4j.org/codes.html#multiple_bindings for an explanation.
[INFO] SLF4J: Actual binding is of type [org.slf4j.impl.Log4jLoggerFactory]
[INFO] 2018-06-13 12:00:06 INFO  ServerInstance:365 - Extracting micro-gw zip file.. 
[INFO] 2018-06-13 12:00:08 INFO  ServerInstance:165 - Server Home <http://54.169.129.84:8080/jenkins/job/product-microgateway/ws/tests/target/micro-gwtmp1528891206592/wso2am-micro-gw-2.5.0>
[INFO] 2018-06-13 12:00:08 INFO  Utils:142 - Port 9070 is closed and available for use
[INFO] 2018-06-13 12:00:08 INFO  ServerInstance:143 - Starting server..
[INFO] 2018-06-13 12:00:08 INFO  ServerInstance:152 - Waiting for port 9070 to open
[INFO] 2018-06-13 12:00:11 INFO  ServerLogReader:114 - could not find package wso2/gateway:*
[INFO] 2018-06-13 12:00:11 INFO  ServerLogReader:114 - ballerina: initiating service(s) in 'common_backend.bal'
[INFO] 2018-06-13 12:00:11 INFO  ServerLogReader:114 - ballerina: started HTTPS/WSS endpoint localhost:9076
[INFO] 2018-06-13 12:00:11 INFO  ServerLogReader:114 - ballerina: started HTTP/WS endpoint localhost:9070
[INFO] 2018-06-13 12:00:12 INFO  ServerInstance:154 - Server Started Successfully.
[INFO] 
[INFO] // Start Running AuthenticationFailureTestCase ...
[INFO] 
[INFO] 2018-06-13 12:00:12 INFO  ServerInstance:365 - Extracting micro-gw zip file.. 
[INFO] 2018-06-13 12:00:13 INFO  ServerInstance:165 - Server Home <http://54.169.129.84:8080/jenkins/job/product-microgateway/ws/tests/target/micro-gwtmp1528891212281/wso2am-micro-gw-2.5.0>
[INFO] 2018-06-13 12:00:13 INFO  ServerInstance:365 - Extracting micro-gw zip file.. 
[INFO] 2018-06-13 12:00:15 INFO  ServerInstance:165 - Server Home <http://54.169.129.84:8080/jenkins/job/product-microgateway/ws/tests/target/micro-gwtmp1528891213758/wso2am-micro-gw-2.5.0>
[INFO] 2018-06-13 12:00:15 INFO  Utils:142 - Port 9090 is closed and available for use
[INFO] 2018-06-13 12:00:15 INFO  ServerInstance:143 - Starting server..
[INFO] 2018-06-13 12:00:15 INFO  ServerInstance:152 - Waiting for port 9090 to open
[INFO] 2018-06-13 12:00:18 INFO  ServerLogReader:114 - could not find package wso2/gateway:*
[INFO] 2018-06-13 12:00:19 INFO  ServerLogReader:114 - ballerina: initiating service(s) in 'pizza_shack_api.bal'
[INFO] 2018-06-13 12:00:19 INFO  ServerLogReader:114 - ballerina: started HTTPS/WSS endpoint localhost:9096
[INFO] 2018-06-13 12:00:19 INFO  ServerLogReader:114 - ballerina: started HTTP/WS endpoint localhost:9090
[INFO] 2018-06-13 12:00:19 INFO  ServerInstance:154 - Server Started Successfully.
[INFO] 2018-06-13 12:00:19 INFO  AuthenticationFailureTestCase:57 - testWithInvalidScopes: RUNNING
[INFO] 2018-06-13 12:00:19 INFO  Utils:142 - Port 9943 is closed and available for use
[INFO] 2018-06-13 12:00:19 INFO  ServerInstance:143 - Starting server..
[INFO] 2018-06-13 12:00:19 INFO  ServerInstance:152 - Waiting for port 9943 to open
[INFO] 2018-06-13 12:00:20 INFO  ServerLogReader:114 - ballerina: initiating service(s) in 'unauthorized.bal'
[INFO] 2018-06-13 12:00:20 INFO  ServerLogReader:114 - ballerina: started HTTP/WS endpoint 0.0.0.0:9943
[INFO] 2018-06-13 12:00:21 INFO  ServerInstance:154 - Server Started Successfully.
[INFO] 2018-06-13 12:00:21 INFO  ServerInstance:177 - Stopping server..
[INFO] 2018-06-13 12:00:22 INFO  ServerInstance:446 - Output of the PID extraction command : users:(("java",711,523))
[INFO] 
[INFO] 2018-06-13 12:00:22 INFO  ServerInstance:466 - Server process id in Linux : 711
[INFO] 2018-06-13 12:00:22 INFO  Utils:139 - Successfully connected to the server on port 9943
[INFO] 2018-06-13 12:00:23 INFO  Utils:142 - Port 9943 is closed and available for use
[INFO] 2018-06-13 12:00:23 INFO  ServerInstance:206 - Server Stopped Successfully
[INFO] 2018-06-13 12:00:23 INFO  AuthenticationFailureTestCase:64 - testWithInvalidScopes: PASSED
[INFO] 2018-06-13 12:00:23 INFO  AuthenticationFailureTestCase:57 - testWithInvalidSubscription: RUNNING
[INFO] 2018-06-13 12:00:23 INFO  Utils:142 - Port 9943 is closed and available for use
[INFO] 2018-06-13 12:00:23 INFO  ServerInstance:143 - Starting server..
[INFO] 2018-06-13 12:00:23 INFO  ServerInstance:152 - Waiting for port 9943 to open
[INFO] 2018-06-13 12:00:24 INFO  ServerLogReader:114 - ballerina: initiating service(s) in 'invalid_subscription.bal'
[INFO] 2018-06-13 12:00:25 INFO  ServerLogReader:114 - ballerina: started HTTP/WS endpoint 0.0.0.0:9943
[INFO] 2018-06-13 12:00:25 INFO  ServerInstance:154 - Server Started Successfully.
[INFO] 2018-06-13 12:00:25 INFO  ServerInstance:177 - Stopping server..
[INFO] 2018-06-13 12:00:25 INFO  ServerInstance:446 - Output of the PID extraction command : users:(("java",776,523))
[INFO] 
[INFO] 2018-06-13 12:00:25 INFO  ServerInstance:466 - Server process id in Linux : 776
[INFO] 2018-06-13 12:00:25 INFO  Utils:139 - Successfully connected to the server on port 9943
[INFO] 2018-06-13 12:00:26 INFO  Utils:142 - Port 9943 is closed and available for use
[INFO] 2018-06-13 12:00:26 INFO  ServerInstance:206 - Server Stopped Successfully
[INFO] 2018-06-13 12:00:26 INFO  AuthenticationFailureTestCase:64 - testWithInvalidSubscription: PASSED
[INFO] 2018-06-13 12:00:26 INFO  AuthenticationFailureTestCase:57 - testWithInvalidToken: RUNNING
[INFO] 2018-06-13 12:00:26 INFO  Utils:142 - Port 9943 is closed and available for use
[INFO] 2018-06-13 12:00:26 INFO  ServerInstance:143 - Starting server..
[INFO] 2018-06-13 12:00:26 INFO  ServerInstance:152 - Waiting for port 9943 to open
[INFO] 2018-06-13 12:00:28 INFO  ServerLogReader:114 - ballerina: initiating service(s) in 'unauthenticated.bal'
[INFO] 2018-06-13 12:00:28 INFO  ServerLogReader:114 - ballerina: started HTTP/WS endpoint 0.0.0.0:9943
[INFO] 2018-06-13 12:00:28 INFO  ServerInstance:154 - Server Started Successfully.
[INFO] 2018-06-13 12:00:28 INFO  ServerInstance:177 - Stopping server..
[INFO] 2018-06-13 12:00:28 INFO  ServerInstance:446 - Output of the PID extraction command : users:(("java",838,523))
[INFO] 
[INFO] 2018-06-13 12:00:28 INFO  ServerInstance:466 - Server process id in Linux : 838
[INFO] 2018-06-13 12:00:28 INFO  Utils:139 - Successfully connected to the server on port 9943
[INFO] 2018-06-13 12:00:29 INFO  Utils:142 - Port 9943 is closed and available for use
[INFO] 2018-06-13 12:00:29 INFO  ServerInstance:206 - Server Stopped Successfully
[INFO] 2018-06-13 12:00:29 INFO  AuthenticationFailureTestCase:64 - testWithInvalidToken: PASSED
[INFO] 2018-06-13 12:00:29 INFO  AuthenticationFailureTestCase:57 - testWithoutAuthHeader: RUNNING
[INFO] 2018-06-13 12:00:29 ERROR ServerLogReader:116 - 2018-06-13 12:00:29,661 ERROR [wso2.gateway] - No authorization header was provided 
[INFO] 2018-06-13 12:00:29 INFO  AuthenticationFailureTestCase:64 - testWithoutAuthHeader: PASSED
[INFO] 2018-06-13 12:00:29 INFO  ServerInstance:177 - Stopping server..
[INFO] 2018-06-13 12:00:29 INFO  ServerInstance:446 - Output of the PID extraction command : users:(("java",646,541))
[INFO] 
[INFO] 2018-06-13 12:00:29 INFO  ServerInstance:466 - Server process id in Linux : 646
[INFO] 2018-06-13 12:00:29 INFO  Utils:142 - Port 9090 is closed and available for use
[INFO] 2018-06-13 12:00:29 INFO  ServerInstance:206 - Server Stopped Successfully
[INFO] 2018-06-13 12:00:29 INFO  ServerInstance:177 - Stopping server..
[INFO] 2018-06-13 12:00:29 INFO  ServerInstance:446 - Output of the PID extraction command : users:(("java",581,536))
[INFO] 
[INFO] 2018-06-13 12:00:29 INFO  ServerInstance:466 - Server process id in Linux : 581
[INFO] 2018-06-13 12:00:29 INFO  Utils:142 - Port 9070 is closed and available for use
[INFO] 2018-06-13 12:00:29 INFO  ServerInstance:206 - Server Stopped Successfully
[INFO] Tests run: 4, Failures: 0, Errors: 0, Skipped: 0, Time elapsed: 23.457 sec - in TestSuite
[INFO] 
[INFO] Results :
[INFO] 
[INFO] Tests run: 4, Failures: 0, Errors: 0, Skipped: 0
[INFO] 
[INFO] [INFO] 
[INFO] [INFO] --- maven-jar-plugin:2.6:jar (default-jar) @ test-integration ---
[INFO] [WARNING] JAR will be empty - no content was marked for inclusion!
[INFO] [INFO] Building jar: <http://54.169.129.84:8080/jenkins/job/product-microgateway/ws/tests/target/test-integration-2.5.0.jar>
[INFO] [INFO] ------------------------------------------------------------------------
[INFO] [INFO] Reactor Summary:
[INFO] [INFO] 
[INFO] [INFO] Micro Gateway - Parent ............................. SUCCESS [  0.364 s]
[INFO] [INFO] Micro Gateway Components ........................... SUCCESS [  0.003 s]
[INFO] [INFO] org.wso2.micro.gateway.core ........................ SUCCESS [ 35.934 s]
[INFO] [INFO] Micro Gateway Code Generator ....................... SUCCESS [  6.841 s]
[INFO] [INFO] WSO2 Micro Gateway - Distribution .................. SUCCESS [ 47.138 s]
[INFO] [INFO] Micro-GW - Test Integration ........................ SUCCESS [ 25.125 s]
[INFO] [INFO] ------------------------------------------------------------------------
[INFO] [INFO] BUILD SUCCESS
[INFO] [INFO] ------------------------------------------------------------------------
[INFO] [INFO] Total time: 01:55 min
[INFO] [INFO] Finished at: 2018-06-13T12:00:30+00:00
[INFO] [INFO] Final Memory: 62M/483M
[INFO] [INFO] ------------------------------------------------------------------------
[INFO] [WARNING] The requested profile "wso2-release" could not be activated because it does not exist.
[INFO] Checking in modified POMs...
[INFO] Executing: /bin/sh -c cd <http://54.169.129.84:8080/jenkins/job/product-microgateway/ws/> && git add -- pom.xml components/pom.xml components/micro-gateway-core/pom.xml components/micro-gateway-cli/pom.xml distribution/pom.xml tests/pom.xml
[INFO] Working directory: <http://54.169.129.84:8080/jenkins/job/product-microgateway/ws/>
[INFO] Executing: /bin/sh -c cd <http://54.169.129.84:8080/jenkins/job/product-microgateway/ws/> && git status
[INFO] Working directory: <http://54.169.129.84:8080/jenkins/job/product-microgateway/ws/>
[INFO] Tagging release with the label v2.5.0...
[INFO] Executing: /bin/sh -c cd <http://54.169.129.84:8080/jenkins/job/product-microgateway/ws/> && git tag -F /tmp/maven-scm-328969510.commit v2.5.0
[INFO] Working directory: <http://54.169.129.84:8080/jenkins/job/product-microgateway/ws/>
[INFO] Executing: /bin/sh -c cd <http://54.169.129.84:8080/jenkins/job/product-microgateway/ws/> && git push https://github.com/wso2/product-microgateway.git v2.5.0
[INFO] Working directory: <http://54.169.129.84:8080/jenkins/job/product-microgateway/ws/>
[INFO] ------------------------------------------------------------------------
[INFO] Reactor Summary:
[INFO] 
[INFO] Micro Gateway - Parent ............................. FAILURE [02:00 min]
[INFO] Micro Gateway Components ........................... SKIPPED
[INFO] org.wso2.micro.gateway.core ........................ SKIPPED
[INFO] Micro Gateway Code Generator ....................... SKIPPED
[INFO] WSO2 Micro Gateway - Distribution .................. SKIPPED
[INFO] Micro-GW - Test Integration ........................ SKIPPED
[INFO] ------------------------------------------------------------------------
[INFO] BUILD FAILURE
[INFO] ------------------------------------------------------------------------
[INFO] Total time: 02:06 min
[INFO] Finished at: 2018-06-13T12:00:35+00:00
[INFO] Final Memory: 22M/316M
[INFO] ------------------------------------------------------------------------
[WARNING] The requested profile "wso2-release" could not be activated because it does not exist.
[ERROR] Failed to execute goal org.apache.maven.plugins:maven-release-plugin:2.3.2:prepare (default-cli) on project micro-gateway-parent: Unable to tag SCM
[ERROR] Provider message:
[ERROR] The git-push command failed.
[ERROR] Command output:
[ERROR] fatal: could not read Username for 'https://github.com': No such device or address
[ERROR] -> [Help 1]
[ERROR] 
[ERROR] To see the full stack trace of the errors, re-run Maven with the -e switch.
[ERROR] Re-run Maven using the -X switch to enable full debug logging.
[ERROR] 
[ERROR] For more information about the errors and possible solutions, please read the following articles:
[ERROR] [Help 1] http://cwiki.apache.org/confluence/display/MAVEN/MojoFailureException
[JENKINS] Archiving <http://54.169.129.84:8080/jenkins/job/product-microgateway/ws/components/micro-gateway-core/pom.xml> to org.wso2.am.microgw/org.wso2.micro.gateway.core/2.5.0-SNAPSHOT/org.wso2.micro.gateway.core-2.5.0-SNAPSHOT.pom
[JENKINS] Archiving <http://54.169.129.84:8080/jenkins/job/product-microgateway/ws/tests/pom.xml> to org.wso2.am.microgw/test-integration/2.5.0-SNAPSHOT/test-integration-2.5.0-SNAPSHOT.pom
[JENKINS] Archiving <http://54.169.129.84:8080/jenkins/job/product-microgateway/ws/components/pom.xml> to org.wso2.am.microgw/components/2.5.0-SNAPSHOT/components-2.5.0-SNAPSHOT.pom
[JENKINS] Archiving <http://54.169.129.84:8080/jenkins/job/product-microgateway/ws/distribution/pom.xml> to org.wso2.am.microgw/wso2am-micro-gw/2.5.0-SNAPSHOT/wso2am-micro-gw-2.5.0-SNAPSHOT.pom
[JENKINS] Archiving <http://54.169.129.84:8080/jenkins/job/product-microgateway/ws/pom.xml> to org.wso2.am.microgw/micro-gateway-parent/2.5.0-SNAPSHOT/micro-gateway-parent-2.5.0-SNAPSHOT.pom
[JENKINS] Archiving <http://54.169.129.84:8080/jenkins/job/product-microgateway/ws/components/micro-gateway-cli/pom.xml> to org.wso2.am.microgw/org.wso2.micro.gateway.cli/2.5.0-SNAPSHOT/org.wso2.micro.gateway.cli-2.5.0-SNAPSHOT.pom
Sending e-mails to: builder at wso2.org malinthaa at wso2.com
channel stopped
 > git rev-parse HEAD^{commit} # timeout=10
 > git rev-parse HEAD^{commit} # timeout=10
------------------------------------------------------------------------

[WSO2 Maven Release] [WSO2 Maven Release] Build Result: FAILURE
[WSO2 Maven Release] Dropping Git Tag: v2.5.0. Reason: FAILURE build.

[WSO2 Maven Release] Deleting release tag from remote.
 > git --version # timeout=10
using GIT_ASKPASS to set credentials github user for maven release plugin (CD)
 > git push https://github.com/wso2/product-microgateway.git :refs/tags/v2.5.0
[WSO2 Maven Release] Dropped git tag - v2.5.0
FATAL: [M2Release] Could not find nexus stage repository for project.

Not sending mail to unregistered user harsz89 at gmail.com
Not sending mail to unregistered user rajithroshan90 at gmail.com


More information about the Builder mailing list