[Builder] Build failed in Jenkins: siddhi » siddhi-execution-geo » Siddhi Execution Extension - Geo Aggregator Pom #150

cbuilder at wso2.org cbuilder at wso2.org
Wed Jun 13 11:49:29 PDT 2018


See <http://54.169.129.84:8080/jenkins/job/siddhi/job/siddhi-execution-geo/org.wso2.extension.siddhi.execution.geo$siddhi-execution-geo-parent/150/display/redirect>

------------------------------------------
[...truncated 461.38 KB...]
[INFO] Downloading: http://maven.wso2.org/nexus/content/repositories/releases/org/eclipse/sisu/org.eclipse.sisu.plexus/0.3.2/org.eclipse.sisu.plexus-0.3.2.pom
[INFO] Downloading: http://maven.wso2.org/nexus/content/groups/wso2-public/org/eclipse/sisu/org.eclipse.sisu.plexus/0.3.2/org.eclipse.sisu.plexus-0.3.2.pom
[INFO] Downloaded: http://maven.wso2.org/nexus/content/groups/wso2-public/org/eclipse/sisu/org.eclipse.sisu.plexus/0.3.2/org.eclipse.sisu.plexus-0.3.2.pom (5 KB at 814.5 KB/sec)
[INFO] Downloading: http://maven.wso2.org/nexus/content/repositories/releases/org/eclipse/sisu/sisu-plexus/0.3.2/sisu-plexus-0.3.2.pom
[INFO] Downloading: http://maven.wso2.org/nexus/content/groups/wso2-public/org/eclipse/sisu/sisu-plexus/0.3.2/sisu-plexus-0.3.2.pom
[INFO] Downloaded: http://maven.wso2.org/nexus/content/groups/wso2-public/org/eclipse/sisu/sisu-plexus/0.3.2/sisu-plexus-0.3.2.pom (14 KB at 2680.9 KB/sec)
[INFO] Downloading: http://maven.wso2.org/nexus/content/repositories/releases/javax/enterprise/cdi-api/1.0/cdi-api-1.0.pom
[INFO] Downloading: http://maven.wso2.org/nexus/content/groups/wso2-public/javax/enterprise/cdi-api/1.0/cdi-api-1.0.pom
[INFO] Downloaded: http://maven.wso2.org/nexus/content/groups/wso2-public/javax/enterprise/cdi-api/1.0/cdi-api-1.0.pom (2 KB at 350.1 KB/sec)
[INFO] Downloading: http://maven.wso2.org/nexus/content/repositories/releases/org/jboss/weld/weld-api-parent/1.0/weld-api-parent-1.0.pom
[INFO] Downloading: http://maven.wso2.org/nexus/content/groups/wso2-public/org/jboss/weld/weld-api-parent/1.0/weld-api-parent-1.0.pom
[INFO] Downloaded: http://maven.wso2.org/nexus/content/groups/wso2-public/org/jboss/weld/weld-api-parent/1.0/weld-api-parent-1.0.pom (3 KB at 575.0 KB/sec)
[INFO] Downloading: http://maven.wso2.org/nexus/content/repositories/releases/org/jboss/weld/weld-api-bom/1.0/weld-api-bom-1.0.pom
[INFO] Downloading: http://maven.wso2.org/nexus/content/groups/wso2-public/org/jboss/weld/weld-api-bom/1.0/weld-api-bom-1.0.pom
[INFO] Downloaded: http://maven.wso2.org/nexus/content/groups/wso2-public/org/jboss/weld/weld-api-bom/1.0/weld-api-bom-1.0.pom (8 KB at 1930.4 KB/sec)
[INFO] Downloading: http://maven.wso2.org/nexus/content/repositories/releases/org/jboss/weld/weld-parent/6/weld-parent-6.pom
[INFO] Downloading: http://maven.wso2.org/nexus/content/groups/wso2-public/org/jboss/weld/weld-parent/6/weld-parent-6.pom
[INFO] Downloaded: http://maven.wso2.org/nexus/content/groups/wso2-public/org/jboss/weld/weld-parent/6/weld-parent-6.pom (21 KB at 4041.4 KB/sec)
[INFO] Downloading: http://maven.wso2.org/nexus/content/repositories/releases/javax/annotation/jsr250-api/1.0/jsr250-api-1.0.pom
[INFO] Downloading: http://maven.wso2.org/nexus/content/groups/wso2-public/javax/annotation/jsr250-api/1.0/jsr250-api-1.0.pom
[INFO] Downloaded: http://maven.wso2.org/nexus/content/groups/wso2-public/javax/annotation/jsr250-api/1.0/jsr250-api-1.0.pom (1023 B at 249.8 KB/sec)
[INFO] Downloading: http://maven.wso2.org/nexus/content/repositories/releases/javax/inject/javax.inject/1/javax.inject-1.pom
[INFO] Downloading: http://maven.wso2.org/nexus/content/groups/wso2-public/javax/inject/javax.inject/1/javax.inject-1.pom
[INFO] Downloaded: http://maven.wso2.org/nexus/content/groups/wso2-public/javax/inject/javax.inject/1/javax.inject-1.pom (612 B at 149.4 KB/sec)
[INFO] Downloading: http://maven.wso2.org/nexus/content/repositories/releases/org/eclipse/sisu/org.eclipse.sisu.inject/0.3.2/org.eclipse.sisu.inject-0.3.2.pom
[INFO] Downloading: http://maven.wso2.org/nexus/content/groups/wso2-public/org/eclipse/sisu/org.eclipse.sisu.inject/0.3.2/org.eclipse.sisu.inject-0.3.2.pom
[INFO] Downloaded: http://maven.wso2.org/nexus/content/groups/wso2-public/org/eclipse/sisu/org.eclipse.sisu.inject/0.3.2/org.eclipse.sisu.inject-0.3.2.pom (3 KB at 640.9 KB/sec)
[INFO] Downloading: http://maven.wso2.org/nexus/content/repositories/releases/org/eclipse/sisu/sisu-inject/0.3.2/sisu-inject-0.3.2.pom
[INFO] Downloading: http://maven.wso2.org/nexus/content/groups/wso2-public/org/eclipse/sisu/sisu-inject/0.3.2/sisu-inject-0.3.2.pom
[INFO] Downloaded: http://maven.wso2.org/nexus/content/groups/wso2-public/org/eclipse/sisu/sisu-inject/0.3.2/sisu-inject-0.3.2.pom (15 KB at 2813.9 KB/sec)
[INFO] Downloading: http://maven.wso2.org/nexus/content/repositories/releases/org/codehaus/plexus/plexus-classworlds/2.5.2/plexus-classworlds-2.5.2.pom
[INFO] Downloading: http://maven.wso2.org/nexus/content/groups/wso2-public/org/codehaus/plexus/plexus-classworlds/2.5.2/plexus-classworlds-2.5.2.pom
[INFO] Downloaded: http://maven.wso2.org/nexus/content/groups/wso2-public/org/codehaus/plexus/plexus-classworlds/2.5.2/plexus-classworlds-2.5.2.pom (8 KB at 1426.8 KB/sec)
[INFO] Downloading: http://maven.wso2.org/nexus/content/repositories/releases/org/codehaus/plexus/plexus-utils/3.0.17/plexus-utils-3.0.17.pom
[INFO] Downloading: http://maven.wso2.org/nexus/content/groups/wso2-public/org/codehaus/plexus/plexus-utils/3.0.17/plexus-utils-3.0.17.pom
[INFO] Downloaded: http://maven.wso2.org/nexus/content/groups/wso2-public/org/codehaus/plexus/plexus-utils/3.0.17/plexus-utils-3.0.17.pom (4 KB at 663.1 KB/sec)
[INFO] Downloading: http://maven.wso2.org/nexus/content/repositories/releases/com/google/inject/guice/4.0/guice-4.0.pom
[INFO] Downloading: http://maven.wso2.org/nexus/content/groups/wso2-public/com/google/inject/guice/4.0/guice-4.0.pom
[INFO] Downloaded: http://maven.wso2.org/nexus/content/groups/wso2-public/com/google/inject/guice/4.0/guice-4.0.pom (11 KB at 2595.9 KB/sec)
[INFO] Downloading: http://maven.wso2.org/nexus/content/repositories/releases/com/google/inject/guice-parent/4.0/guice-parent-4.0.pom
[INFO] Downloading: http://maven.wso2.org/nexus/content/groups/wso2-public/com/google/inject/guice-parent/4.0/guice-parent-4.0.pom
[INFO] Downloaded: http://maven.wso2.org/nexus/content/groups/wso2-public/com/google/inject/guice-parent/4.0/guice-parent-4.0.pom (16 KB at 3025.8 KB/sec)
[INFO] Downloading: http://maven.wso2.org/nexus/content/repositories/releases/com/google/google/5/google-5.pom
[INFO] Downloading: http://maven.wso2.org/nexus/content/groups/wso2-public/com/google/google/5/google-5.pom
[INFO] Downloaded: http://maven.wso2.org/nexus/content/groups/wso2-public/com/google/google/5/google-5.pom (3 KB at 600.1 KB/sec)
[INFO] Downloading: http://maven.wso2.org/nexus/content/repositories/releases/aopalliance/aopalliance/1.0/aopalliance-1.0.pom
[INFO] Downloading: http://maven.wso2.org/nexus/content/groups/wso2-public/aopalliance/aopalliance/1.0/aopalliance-1.0.pom
[INFO] Downloaded: http://maven.wso2.org/nexus/content/groups/wso2-public/aopalliance/aopalliance/1.0/aopalliance-1.0.pom (363 B at 88.6 KB/sec)
[INFO] Downloading: http://maven.wso2.org/nexus/content/repositories/releases/org/apache/commons/commons-io/1.3.2/commons-io-1.3.2.pom
[INFO] Downloading: http://maven.wso2.org/nexus/content/groups/wso2-public/org/apache/commons/commons-io/1.3.2/commons-io-1.3.2.pom
[INFO] Downloaded: http://maven.wso2.org/nexus/content/groups/wso2-public/org/apache/commons/commons-io/1.3.2/commons-io-1.3.2.pom (640 B at 125.0 KB/sec)
[INFO] Downloading: http://maven.wso2.org/nexus/content/repositories/releases/commons-io/commons-io/1.3.2/commons-io-1.3.2.pom
[INFO] Downloading: http://maven.wso2.org/nexus/content/groups/wso2-public/commons-io/commons-io/1.3.2/commons-io-1.3.2.pom
[INFO] Downloaded: http://maven.wso2.org/nexus/content/groups/wso2-public/commons-io/commons-io/1.3.2/commons-io-1.3.2.pom (10 KB at 1899.6 KB/sec)
[INFO] Downloading: http://maven.wso2.org/nexus/content/repositories/releases/org/apache/commons/commons-parent/3/commons-parent-3.pom
[INFO] Downloading: http://maven.wso2.org/nexus/content/groups/wso2-public/org/apache/commons/commons-parent/3/commons-parent-3.pom
[INFO] Downloaded: http://maven.wso2.org/nexus/content/groups/wso2-public/org/apache/commons/commons-parent/3/commons-parent-3.pom (12 KB at 2883.5 KB/sec)
[INFO] Downloading: http://maven.wso2.org/nexus/content/repositories/releases/org/slf4j/slf4j-api/1.7.12/slf4j-api-1.7.12.jar
[INFO] Downloading: http://maven.wso2.org/nexus/content/repositories/releases/org/apache/maven/plugin-tools/maven-plugin-annotations/3.4/maven-plugin-annotations-3.4.jar
[INFO] Downloading: http://maven.wso2.org/nexus/content/repositories/releases/org/freemarker/freemarker-gae/2.3.25-incubating/freemarker-gae-2.3.25-incubating.jar
[INFO] Downloading: http://maven.wso2.org/nexus/content/repositories/releases/org/yaml/snakeyaml/1.18/snakeyaml-1.18.jar
[INFO] Downloading: http://maven.wso2.org/nexus/content/repositories/releases/org/apache/maven/maven-builder-support/3.3.9/maven-builder-support-3.3.9.jar
[INFO] Downloading: http://maven.wso2.org/nexus/content/repositories/releases/org/eclipse/aether/aether-spi/1.0.2.v20150114/aether-spi-1.0.2.v20150114.jar
[INFO] Downloading: http://maven.wso2.org/nexus/content/repositories/releases/org/eclipse/aether/aether-impl/1.0.2.v20150114/aether-impl-1.0.2.v20150114.jar
[INFO] Downloading: http://maven.wso2.org/nexus/content/repositories/releases/org/eclipse/aether/aether-api/1.0.2.v20150114/aether-api-1.0.2.v20150114.jar
[INFO] Downloading: http://maven.wso2.org/nexus/content/repositories/releases/org/eclipse/aether/aether-util/1.0.2.v20150114/aether-util-1.0.2.v20150114.jar
[INFO] Downloading: http://maven.wso2.org/nexus/content/repositories/releases/org/eclipse/sisu/org.eclipse.sisu.plexus/0.3.2/org.eclipse.sisu.plexus-0.3.2.jar
[INFO] Downloading: http://maven.wso2.org/nexus/content/repositories/releases/javax/enterprise/cdi-api/1.0/cdi-api-1.0.jar
[INFO] Downloading: http://maven.wso2.org/nexus/content/repositories/releases/javax/annotation/jsr250-api/1.0/jsr250-api-1.0.jar
[INFO] Downloading: http://maven.wso2.org/nexus/content/repositories/releases/org/eclipse/sisu/org.eclipse.sisu.inject/0.3.2/org.eclipse.sisu.inject-0.3.2.jar
[INFO] Downloading: http://maven.wso2.org/nexus/content/repositories/releases/com/google/inject/guice/4.0/guice-4.0-no_aop.jar
[INFO] Downloading: http://maven.wso2.org/nexus/content/repositories/releases/javax/inject/javax.inject/1/javax.inject-1.jar
[INFO] Downloading: http://maven.wso2.org/nexus/content/repositories/releases/aopalliance/aopalliance/1.0/aopalliance-1.0.jar
[INFO] Downloading: http://maven.wso2.org/nexus/content/repositories/releases/org/codehaus/plexus/plexus-component-annotations/1.6/plexus-component-annotations-1.6.jar
[INFO] Downloading: http://maven.wso2.org/nexus/content/repositories/releases/commons-io/commons-io/1.3.2/commons-io-1.3.2.jar
[INFO] Downloading: http://maven.wso2.org/nexus/content/groups/wso2-public/org/slf4j/slf4j-api/1.7.12/slf4j-api-1.7.12.jar
[INFO] Downloading: http://maven.wso2.org/nexus/content/groups/wso2-public/org/apache/maven/plugin-tools/maven-plugin-annotations/3.4/maven-plugin-annotations-3.4.jar
[INFO] Downloading: http://maven.wso2.org/nexus/content/groups/wso2-public/org/freemarker/freemarker-gae/2.3.25-incubating/freemarker-gae-2.3.25-incubating.jar
[INFO] Downloading: http://maven.wso2.org/nexus/content/groups/wso2-public/org/yaml/snakeyaml/1.18/snakeyaml-1.18.jar
[INFO] Downloading: http://maven.wso2.org/nexus/content/groups/wso2-public/org/apache/maven/maven-builder-support/3.3.9/maven-builder-support-3.3.9.jar
[INFO] Downloaded: http://maven.wso2.org/nexus/content/groups/wso2-public/org/apache/maven/plugin-tools/maven-plugin-annotations/3.4/maven-plugin-annotations-3.4.jar (14 KB at 2782.6 KB/sec)
[INFO] Downloading: http://maven.wso2.org/nexus/content/groups/wso2-public/org/eclipse/aether/aether-spi/1.0.2.v20150114/aether-spi-1.0.2.v20150114.jar
[INFO] Downloaded: http://maven.wso2.org/nexus/content/groups/wso2-public/org/slf4j/slf4j-api/1.7.12/slf4j-api-1.7.12.jar (32 KB at 5229.0 KB/sec)
[INFO] Downloading: http://maven.wso2.org/nexus/content/groups/wso2-public/org/eclipse/aether/aether-impl/1.0.2.v20150114/aether-impl-1.0.2.v20150114.jar
[INFO] Downloaded: http://maven.wso2.org/nexus/content/groups/wso2-public/org/apache/maven/maven-builder-support/3.3.9/maven-builder-support-3.3.9.jar (15 KB at 2420.7 KB/sec)
[INFO] Downloading: http://maven.wso2.org/nexus/content/groups/wso2-public/org/eclipse/aether/aether-api/1.0.2.v20150114/aether-api-1.0.2.v20150114.jar
[INFO] Downloaded: http://maven.wso2.org/nexus/content/groups/wso2-public/org/yaml/snakeyaml/1.18/snakeyaml-1.18.jar (278 KB at 34709.2 KB/sec)
[INFO] Downloading: http://maven.wso2.org/nexus/content/groups/wso2-public/org/eclipse/aether/aether-util/1.0.2.v20150114/aether-util-1.0.2.v20150114.jar
[INFO] Downloaded: http://maven.wso2.org/nexus/content/groups/wso2-public/org/eclipse/aether/aether-spi/1.0.2.v20150114/aether-spi-1.0.2.v20150114.jar (30 KB at 4283.6 KB/sec)
[INFO] Downloading: http://maven.wso2.org/nexus/content/groups/wso2-public/org/eclipse/sisu/org.eclipse.sisu.plexus/0.3.2/org.eclipse.sisu.plexus-0.3.2.jar
[INFO] Downloaded: http://maven.wso2.org/nexus/content/groups/wso2-public/org/eclipse/aether/aether-impl/1.0.2.v20150114/aether-impl-1.0.2.v20150114.jar (169 KB at 18771.5 KB/sec)
[INFO] Downloading: http://maven.wso2.org/nexus/content/groups/wso2-public/javax/enterprise/cdi-api/1.0/cdi-api-1.0.jar
[INFO] Downloaded: http://maven.wso2.org/nexus/content/groups/wso2-public/org/eclipse/aether/aether-util/1.0.2.v20150114/aether-util-1.0.2.v20150114.jar (144 KB at 17929.2 KB/sec)
[INFO] Downloading: http://maven.wso2.org/nexus/content/groups/wso2-public/javax/annotation/jsr250-api/1.0/jsr250-api-1.0.jar
[INFO] Downloaded: http://maven.wso2.org/nexus/content/groups/wso2-public/org/eclipse/aether/aether-api/1.0.2.v20150114/aether-api-1.0.2.v20150114.jar (134 KB at 13312.9 KB/sec)
[INFO] Downloading: http://maven.wso2.org/nexus/content/groups/wso2-public/org/eclipse/sisu/org.eclipse.sisu.inject/0.3.2/org.eclipse.sisu.inject-0.3.2.jar
[INFO] Downloaded: http://maven.wso2.org/nexus/content/groups/wso2-public/javax/enterprise/cdi-api/1.0/cdi-api-1.0.jar (44 KB at 7309.2 KB/sec)
[INFO] Downloading: http://maven.wso2.org/nexus/content/groups/wso2-public/com/google/inject/guice/4.0/guice-4.0-no_aop.jar
[INFO] Downloaded: http://maven.wso2.org/nexus/content/groups/wso2-public/org/eclipse/sisu/org.eclipse.sisu.plexus/0.3.2/org.eclipse.sisu.plexus-0.3.2.jar (201 KB at 22289.6 KB/sec)
[INFO] Downloading: http://maven.wso2.org/nexus/content/groups/wso2-public/javax/inject/javax.inject/1/javax.inject-1.jar
[INFO] Downloaded: http://maven.wso2.org/nexus/content/groups/wso2-public/javax/annotation/jsr250-api/1.0/jsr250-api-1.0.jar (6 KB at 815.8 KB/sec)
[INFO] Downloading: http://maven.wso2.org/nexus/content/groups/wso2-public/aopalliance/aopalliance/1.0/aopalliance-1.0.jar
[INFO] Downloaded: http://maven.wso2.org/nexus/content/groups/wso2-public/org/freemarker/freemarker-gae/2.3.25-incubating/freemarker-gae-2.3.25-incubating.jar (1461 KB at 60865.7 KB/sec)
[INFO] Downloading: http://maven.wso2.org/nexus/content/groups/wso2-public/org/codehaus/plexus/plexus-component-annotations/1.6/plexus-component-annotations-1.6.jar
[INFO] Downloaded: http://maven.wso2.org/nexus/content/groups/wso2-public/org/eclipse/sisu/org.eclipse.sisu.inject/0.3.2/org.eclipse.sisu.inject-0.3.2.jar (369 KB at 36879.1 KB/sec)
[INFO] Downloading: http://maven.wso2.org/nexus/content/groups/wso2-public/commons-io/commons-io/1.3.2/commons-io-1.3.2.jar
[INFO] Downloaded: http://maven.wso2.org/nexus/content/groups/wso2-public/aopalliance/aopalliance/1.0/aopalliance-1.0.jar (5 KB at 872.5 KB/sec)
[INFO] Downloaded: http://maven.wso2.org/nexus/content/groups/wso2-public/javax/inject/javax.inject/1/javax.inject-1.jar (3 KB at 348.4 KB/sec)
[INFO] Downloaded: http://maven.wso2.org/nexus/content/groups/wso2-public/com/google/inject/guice/4.0/guice-4.0-no_aop.jar (414 KB at 45959.2 KB/sec)
[INFO] Downloaded: http://maven.wso2.org/nexus/content/groups/wso2-public/org/codehaus/plexus/plexus-component-annotations/1.6/plexus-component-annotations-1.6.jar (5 KB at 694.2 KB/sec)
[INFO] Downloaded: http://maven.wso2.org/nexus/content/groups/wso2-public/commons-io/commons-io/1.3.2/commons-io-1.3.2.jar (86 KB at 12245.5 KB/sec)
[INFO] log4j:WARN No appenders could be found for logger (freemarker.cache).
[INFO] log4j:WARN Please initialize the log4j system properly.
[INFO] log4j:WARN See http://logging.apache.org/log4j/1.2/faq.html#noconfig for more info.
[INFO] [INFO] 
[INFO] [INFO] --- siddhi-doc-gen:4.1.38:deploy-mkdocs-github-pages (default) @ siddhi-execution-geo ---
[INFO] [INFO] Executing: mkdocs build -c -f <http://54.169.129.84:8080/jenkins/job/siddhi/job/siddhi-execution-geo/org.wso2.extension.siddhi.execution.geo$siddhi-execution-geo-parent/ws/mkdocs.yml> -d site
[INFO] [INFO] Executing: git add <http://54.169.129.84:8080/jenkins/job/siddhi/job/siddhi-execution-geo/org.wso2.extension.siddhi.execution.geo$siddhi-execution-geo-parent/ws/docs> <http://54.169.129.84:8080/jenkins/job/siddhi/job/siddhi-execution-geo/org.wso2.extension.siddhi.execution.geo$siddhi-execution-geo-parent/ws/mkdocs.yml> <http://54.169.129.84:8080/jenkins/job/siddhi/job/siddhi-execution-geo/org.wso2.extension.siddhi.execution.geo$siddhi-execution-geo-parent/ws/README.md>
[INFO] [INFO] Executing: git commit -m [WSO2-Release] [Release 4.0.10] update documentation for release 4.0.10 -- <http://54.169.129.84:8080/jenkins/job/siddhi/job/siddhi-execution-geo/org.wso2.extension.siddhi.execution.geo$siddhi-execution-geo-parent/ws/docs> <http://54.169.129.84:8080/jenkins/job/siddhi/job/siddhi-execution-geo/org.wso2.extension.siddhi.execution.geo$siddhi-execution-geo-parent/ws/mkdocs.yml> <http://54.169.129.84:8080/jenkins/job/siddhi/job/siddhi-execution-geo/org.wso2.extension.siddhi.execution.geo$siddhi-execution-geo-parent/ws/README.md>
[INFO] [INFO] Executing: git branch
[INFO] [INFO] Executing: git stash
[INFO] [INFO] Executing: git checkout gh-pages
[INFO] [INFO] Executing: git checkout --orphan gh-pages
[INFO] [INFO] Executing: git pull origin gh-pages
[INFO] [INFO] Executing: git add assets images index.html 404.html mkdocs javascripts stylesheets sitemap.xml api license
[INFO] [INFO] Executing: git commit -m [WSO2-Release] [Release 4.0.10] update documentation for release 4.0.10 -- assets images index.html 404.html mkdocs javascripts stylesheets sitemap.xml api license
[INFO] [INFO] Executing: git push https://wso2-jenkins-bot:c866c060254b7b0b6a0c177bb2183595c579471e@github.com/wso2-extensions/siddhi-execution-geo.git gh-pages
[INFO] [INFO] Executing: git checkout release-4.0.10-v827
[INFO] [INFO] Executing: git stash pop
[INFO] [INFO] 
[INFO] [INFO] --- maven-resources-plugin:2.7:testResources (default-testResources) @ siddhi-execution-geo ---
[INFO] [INFO] Using 'UTF-8' encoding to copy filtered resources.
[INFO] [INFO] Copying 2 resources
[INFO] [INFO] Copying 3 resources
[INFO] [INFO] 
[INFO] [INFO] --- maven-compiler-plugin:2.0:testCompile (default-testCompile) @ siddhi-execution-geo ---
[INFO] Compiling 2 source files to <http://54.169.129.84:8080/jenkins/job/siddhi/job/siddhi-execution-geo/org.wso2.extension.siddhi.execution.geo$siddhi-execution-geo-parent/ws/component/target/test-classes>
[INFO] [INFO] 
[INFO] [INFO] --- maven-surefire-plugin:2.19.1:test (default-test) @ siddhi-execution-geo ---
[INFO] Downloading: http://maven.wso2.org/nexus/content/repositories/releases/org/apache/maven/surefire/maven-surefire-common/2.19.1/maven-surefire-common-2.19.1.pom
[INFO] Downloading: http://maven.wso2.org/nexus/content/groups/wso2-public/org/apache/maven/surefire/maven-surefire-common/2.19.1/maven-surefire-common-2.19.1.pom
[INFO] Downloaded: http://maven.wso2.org/nexus/content/groups/wso2-public/org/apache/maven/surefire/maven-surefire-common/2.19.1/maven-surefire-common-2.19.1.pom (8 KB at 1193.5 KB/sec)
[INFO] Downloading: http://maven.wso2.org/nexus/content/repositories/releases/org/apache/maven/plugin-tools/maven-plugin-annotations/3.3/maven-plugin-annotations-3.3.pom
[INFO] Downloading: http://maven.wso2.org/nexus/content/groups/wso2-public/org/apache/maven/plugin-tools/maven-plugin-annotations/3.3/maven-plugin-annotations-3.3.pom
[INFO] Downloaded: http://maven.wso2.org/nexus/content/groups/wso2-public/org/apache/maven/plugin-tools/maven-plugin-annotations/3.3/maven-plugin-annotations-3.3.pom (2 KB at 265.1 KB/sec)
[INFO] Downloading: http://maven.wso2.org/nexus/content/repositories/releases/org/apache/maven/plugin-tools/maven-plugin-tools/3.3/maven-plugin-tools-3.3.pom
[INFO] Downloading: http://maven.wso2.org/nexus/content/groups/wso2-public/org/apache/maven/plugin-tools/maven-plugin-tools/3.3/maven-plugin-tools-3.3.pom
[INFO] Downloaded: http://maven.wso2.org/nexus/content/groups/wso2-public/org/apache/maven/plugin-tools/maven-plugin-tools/3.3/maven-plugin-tools-3.3.pom (13 KB at 2470.3 KB/sec)
[INFO] Downloading: http://maven.wso2.org/nexus/content/repositories/releases/org/apache/maven/surefire/surefire-api/2.19.1/surefire-api-2.19.1.pom
[INFO] Downloading: http://maven.wso2.org/nexus/content/groups/wso2-public/org/apache/maven/surefire/surefire-api/2.19.1/surefire-api-2.19.1.pom
[INFO] Downloaded: http://maven.wso2.org/nexus/content/groups/wso2-public/org/apache/maven/surefire/surefire-api/2.19.1/surefire-api-2.19.1.pom (4 KB at 571.3 KB/sec)
[INFO] Downloading: http://maven.wso2.org/nexus/content/repositories/releases/org/apache/maven/surefire/surefire-booter/2.19.1/surefire-booter-2.19.1.pom
[INFO] Downloading: http://maven.wso2.org/nexus/content/groups/wso2-public/org/apache/maven/surefire/surefire-booter/2.19.1/surefire-booter-2.19.1.pom
[INFO] Downloaded: http://maven.wso2.org/nexus/content/groups/wso2-public/org/apache/maven/surefire/surefire-booter/2.19.1/surefire-booter-2.19.1.pom (4 KB at 621.7 KB/sec)
[INFO] Downloading: http://maven.wso2.org/nexus/content/repositories/releases/org/apache/commons/commons-lang3/3.1/commons-lang3-3.1.pom
[INFO] Downloading: http://maven.wso2.org/nexus/content/groups/wso2-public/org/apache/commons/commons-lang3/3.1/commons-lang3-3.1.pom
[INFO] Downloaded: http://maven.wso2.org/nexus/content/groups/wso2-public/org/apache/commons/commons-lang3/3.1/commons-lang3-3.1.pom (17 KB at 4079.8 KB/sec)
[INFO] Downloading: http://maven.wso2.org/nexus/content/repositories/releases/org/apache/maven/surefire/maven-surefire-common/2.19.1/maven-surefire-common-2.19.1.jar
[INFO] Downloading: http://maven.wso2.org/nexus/content/repositories/releases/org/apache/maven/surefire/surefire-booter/2.19.1/surefire-booter-2.19.1.jar
[INFO] Downloading: http://maven.wso2.org/nexus/content/repositories/releases/junit/junit/4.12/junit-4.12.jar
[INFO] Downloading: http://maven.wso2.org/nexus/content/repositories/releases/org/apache/commons/commons-lang3/3.1/commons-lang3-3.1.jar
[INFO] Downloading: http://maven.wso2.org/nexus/content/repositories/releases/org/apache/maven/surefire/surefire-api/2.19.1/surefire-api-2.19.1.jar
[INFO] Downloading: http://maven.wso2.org/nexus/content/repositories/releases/org/apache/maven/plugin-tools/maven-plugin-annotations/3.3/maven-plugin-annotations-3.3.jar
[INFO] Downloading: http://maven.wso2.org/nexus/content/groups/wso2-public/org/apache/maven/surefire/maven-surefire-common/2.19.1/maven-surefire-common-2.19.1.jar
[INFO] Downloading: http://maven.wso2.org/nexus/content/groups/wso2-public/org/apache/maven/surefire/surefire-booter/2.19.1/surefire-booter-2.19.1.jar
[INFO] Downloading: http://maven.wso2.org/nexus/content/groups/wso2-public/junit/junit/4.12/junit-4.12.jar
[INFO] Downloading: http://maven.wso2.org/nexus/content/groups/wso2-public/org/apache/commons/commons-lang3/3.1/commons-lang3-3.1.jar
[INFO] Downloading: http://maven.wso2.org/nexus/content/groups/wso2-public/org/apache/maven/surefire/surefire-api/2.19.1/surefire-api-2.19.1.jar
[INFO] Downloaded: http://maven.wso2.org/nexus/content/groups/wso2-public/org/apache/maven/surefire/surefire-api/2.19.1/surefire-api-2.19.1.jar (192 KB at 27353.9 KB/sec)
[INFO] Downloading: http://maven.wso2.org/nexus/content/groups/wso2-public/org/apache/maven/plugin-tools/maven-plugin-annotations/3.3/maven-plugin-annotations-3.3.jar
[INFO] Downloaded: http://maven.wso2.org/nexus/content/groups/wso2-public/org/apache/maven/surefire/surefire-booter/2.19.1/surefire-booter-2.19.1.jar (45 KB at 5554.2 KB/sec)
[INFO] Downloaded: http://maven.wso2.org/nexus/content/groups/wso2-public/junit/junit/4.12/junit-4.12.jar (308 KB at 34172.3 KB/sec)
[INFO] Downloaded: http://maven.wso2.org/nexus/content/groups/wso2-public/org/apache/maven/surefire/maven-surefire-common/2.19.1/maven-surefire-common-2.19.1.jar (286 KB at 25967.9 KB/sec)
[INFO] Downloaded: http://maven.wso2.org/nexus/content/groups/wso2-public/org/apache/commons/commons-lang3/3.1/commons-lang3-3.1.jar (309 KB at 28036.7 KB/sec)
[INFO] Downloaded: http://maven.wso2.org/nexus/content/groups/wso2-public/org/apache/maven/plugin-tools/maven-plugin-annotations/3.3/maven-plugin-annotations-3.3.jar (14 KB at 2285.0 KB/sec)
[INFO] Downloading: http://maven.wso2.org/nexus/content/repositories/releases/org/apache/maven/surefire/surefire-testng/2.19.1/surefire-testng-2.19.1.pom
[INFO] Downloading: http://maven.wso2.org/nexus/content/groups/wso2-public/org/apache/maven/surefire/surefire-testng/2.19.1/surefire-testng-2.19.1.pom
[INFO] Downloaded: http://maven.wso2.org/nexus/content/groups/wso2-public/org/apache/maven/surefire/surefire-testng/2.19.1/surefire-testng-2.19.1.pom (3 KB at 453.9 KB/sec)
[INFO] Downloading: http://maven.wso2.org/nexus/content/repositories/releases/org/apache/maven/surefire/surefire-providers/2.19.1/surefire-providers-2.19.1.pom
[INFO] Downloading: http://maven.wso2.org/nexus/content/groups/wso2-public/org/apache/maven/surefire/surefire-providers/2.19.1/surefire-providers-2.19.1.pom
[INFO] Downloaded: http://maven.wso2.org/nexus/content/groups/wso2-public/org/apache/maven/surefire/surefire-providers/2.19.1/surefire-providers-2.19.1.pom (3 KB at 500.6 KB/sec)
[INFO] Downloading: http://maven.wso2.org/nexus/content/repositories/releases/org/apache/maven/surefire/common-java5/2.19.1/common-java5-2.19.1.pom
[INFO] Downloading: http://maven.wso2.org/nexus/content/groups/wso2-public/org/apache/maven/surefire/common-java5/2.19.1/common-java5-2.19.1.pom
[INFO] Downloaded: http://maven.wso2.org/nexus/content/groups/wso2-public/org/apache/maven/surefire/common-java5/2.19.1/common-java5-2.19.1.pom (3 KB at 435.7 KB/sec)
[INFO] Downloading: http://maven.wso2.org/nexus/content/repositories/releases/org/apache/maven/surefire/surefire-testng-utils/2.19.1/surefire-testng-utils-2.19.1.pom
[INFO] Downloading: http://maven.wso2.org/nexus/content/groups/wso2-public/org/apache/maven/surefire/surefire-testng-utils/2.19.1/surefire-testng-utils-2.19.1.pom
[INFO] Downloaded: http://maven.wso2.org/nexus/content/groups/wso2-public/org/apache/maven/surefire/surefire-testng-utils/2.19.1/surefire-testng-utils-2.19.1.pom (3 KB at 596.5 KB/sec)
[INFO] Downloading: http://maven.wso2.org/nexus/content/repositories/releases/org/apache/maven/surefire/surefire-grouper/2.19.1/surefire-grouper-2.19.1.pom
[INFO] Downloading: http://maven.wso2.org/nexus/content/groups/wso2-public/org/apache/maven/surefire/surefire-grouper/2.19.1/surefire-grouper-2.19.1.pom
[INFO] Downloaded: http://maven.wso2.org/nexus/content/groups/wso2-public/org/apache/maven/surefire/surefire-grouper/2.19.1/surefire-grouper-2.19.1.pom (3 KB at 513.3 KB/sec)
[INFO] Downloading: http://maven.wso2.org/nexus/content/repositories/releases/org/apache/maven/surefire/common-java5/2.19.1/common-java5-2.19.1.jar
[INFO] Downloading: http://maven.wso2.org/nexus/content/repositories/releases/org/apache/maven/surefire/surefire-grouper/2.19.1/surefire-grouper-2.19.1.jar
[INFO] Downloading: http://maven.wso2.org/nexus/content/repositories/releases/org/apache/maven/surefire/surefire-testng/2.19.1/surefire-testng-2.19.1.jar
[INFO] Downloading: http://maven.wso2.org/nexus/content/repositories/releases/org/apache/maven/surefire/surefire-testng-utils/2.19.1/surefire-testng-utils-2.19.1.jar
[INFO] Downloading: http://maven.wso2.org/nexus/content/groups/wso2-public/org/apache/maven/surefire/surefire-grouper/2.19.1/surefire-grouper-2.19.1.jar
[INFO] Downloading: http://maven.wso2.org/nexus/content/groups/wso2-public/org/apache/maven/surefire/surefire-testng-utils/2.19.1/surefire-testng-utils-2.19.1.jar
[INFO] Downloading: http://maven.wso2.org/nexus/content/groups/wso2-public/org/apache/maven/surefire/surefire-testng/2.19.1/surefire-testng-2.19.1.jar
[INFO] Downloading: http://maven.wso2.org/nexus/content/groups/wso2-public/org/apache/maven/surefire/common-java5/2.19.1/common-java5-2.19.1.jar
[INFO] Downloaded: http://maven.wso2.org/nexus/content/groups/wso2-public/org/apache/maven/surefire/surefire-testng-utils/2.19.1/surefire-testng-utils-2.19.1.jar (27 KB at 5261.5 KB/sec)
[INFO] Downloaded: http://maven.wso2.org/nexus/content/groups/wso2-public/org/apache/maven/surefire/surefire-grouper/2.19.1/surefire-grouper-2.19.1.jar (38 KB at 5353.0 KB/sec)
[INFO] Downloaded: http://maven.wso2.org/nexus/content/groups/wso2-public/org/apache/maven/surefire/surefire-testng/2.19.1/surefire-testng-2.19.1.jar (42 KB at 6909.7 KB/sec)
[INFO] Downloaded: http://maven.wso2.org/nexus/content/groups/wso2-public/org/apache/maven/surefire/common-java5/2.19.1/common-java5-2.19.1.jar (44 KB at 6156.1 KB/sec)
[INFO] 
[INFO] -------------------------------------------------------
[INFO]  T E S T S
[INFO] -------------------------------------------------------
[INFO] Running TestSuite
[INFO] Init Siddhi setUp
[INFO] Time to add query: [0.416000 sec]
[INFO] Test Reverse Geocode 1 - Coordinates in LK
[INFO] [Event{timestamp=1528915764732, data=[12, N/A, Palm Grove, Colombo, Western Province, Sri Lanka, LK, 00300, 12 Palm Grove, Colombo 00300, Sri Lanka], isExpired=false}]
[INFO] Tests run: 9, Failures: 1, Errors: 0, Skipped: 7, Time elapsed: 2.726 sec <<< FAILURE! - in TestSuite
[INFO] testReverseGeocode1(org.wso2.extension.siddhi.execution.geo.ReverseGeocodeStreamFunctionProcessorTest)  Time elapsed: 0.134 sec  <<< FAILURE!
[INFO] org.testng.internal.junit.ArrayComparisonFailure: arrays first differed at element [0]; expected:<27> but was:<12>
[INFO] 	at org.wso2.extension.siddhi.execution.geo.ReverseGeocodeStreamFunctionProcessorTest.testReverseGeocode1(ReverseGeocodeStreamFunctionProcessorTest.java:79)
[INFO] 
[INFO] 
[INFO] Results :
[INFO] 
[INFO] Failed tests: 
[INFO]   ReverseGeocodeStreamFunctionProcessorTest.testReverseGeocode1:79 arrays first differed at element [0]; expected:<27> but was:<12>
[INFO] 
[INFO] Tests run: 9, Failures: 1, Errors: 0, Skipped: 7
[INFO] 
[INFO] [INFO] ------------------------------------------------------------------------
[INFO] [INFO] Reactor Summary:
[INFO] [INFO] 
[INFO] [INFO] Siddhi Execution Extension - Geo Aggregator Pom ... SUCCESS [12.480s]
[INFO] [INFO] Siddhi Execution Extension - Geo .................. FAILURE [15.049s]
[INFO] [INFO] ------------------------------------------------------------------------
[INFO] [INFO] BUILD FAILURE
[INFO] [INFO] ------------------------------------------------------------------------
[INFO] [INFO] Total time: 27.990s
[INFO] [INFO] Finished at: Wed Jun 13 18:49:25 UTC 2018
[INFO] [INFO] Final Memory: 52M/477M
[INFO] [INFO] ------------------------------------------------------------------------
[INFO] [ERROR] Failed to execute goal org.apache.maven.plugins:maven-surefire-plugin:2.19.1:test (default-test) on project siddhi-execution-geo: There are test failures.
[INFO] [ERROR] 
[INFO] [ERROR] Please refer to <http://54.169.129.84:8080/jenkins/job/siddhi/job/siddhi-execution-geo/org.wso2.extension.siddhi.execution.geo$siddhi-execution-geo-parent/ws/component/target/surefire-reports> for the individual test results.
[INFO] [ERROR] -> [Help 1]
[INFO] [ERROR] 
[INFO] [ERROR] To see the full stack trace of the errors, re-run Maven with the -e switch.
[INFO] [ERROR] Re-run Maven using the -X switch to enable full debug logging.
[INFO] [ERROR] 
[INFO] [ERROR] For more information about the errors and possible solutions, please read the following articles:
[INFO] [ERROR] [Help 1] http://cwiki.apache.org/confluence/display/MAVEN/MojoFailureException
[INFO] [ERROR] 
[INFO] [ERROR] After correcting the problems, you can resume the build with the command
[INFO] [ERROR]   mvn <goals> -rf :siddhi-execution-geo


More information about the Builder mailing list