[Builder] Build failed in Jenkins: Ballerina Platform » ballerina » Ballerina - Plugin VSCode #2935

cbuilder at wso2.org cbuilder at wso2.org
Wed Oct 17 22:49:28 PDT 2018


See <https://wso2.org/jenkins/job/ballerina-platform/job/ballerina/org.ballerinalang$plugin-vscode/2935/display/redirect>

------------------------------------------
[INFO]                                                                         
[INFO] ------------------------------------------------------------------------
[INFO] Building Ballerina - Plugin VSCode 0.982.1-SNAPSHOT
[INFO] ------------------------------------------------------------------------
Downloading: http://maven.wso2.org/nexus/content/repositories/releases/com/google/code/maven-replacer-plugin/replacer/1.5.3/replacer-1.5.3.pom
Downloading: http://maven.wso2.org/nexus/content/groups/wso2-public/com/google/code/maven-replacer-plugin/replacer/1.5.3/replacer-1.5.3.pom
Downloaded: http://maven.wso2.org/nexus/content/groups/wso2-public/com/google/code/maven-replacer-plugin/replacer/1.5.3/replacer-1.5.3.pom (6 KB at 1141.8 KB/sec)
Downloading: http://maven.wso2.org/nexus/content/repositories/releases/com/google/code/maven-replacer-plugin/replacer/1.5.3/replacer-1.5.3.jar
Downloading: http://maven.wso2.org/nexus/content/groups/wso2-public/com/google/code/maven-replacer-plugin/replacer/1.5.3/replacer-1.5.3.jar
Downloaded: http://maven.wso2.org/nexus/content/groups/wso2-public/com/google/code/maven-replacer-plugin/replacer/1.5.3/replacer-1.5.3.jar (39 KB at 6459.1 KB/sec)
[INFO] 
[INFO] --- maven-clean-plugin:3.0.0:clean (default-clean) @ plugin-vscode ---
[INFO] 
[INFO] --- maven-antrun-plugin:1.8:run (clean-target-server-build-dirs) @ plugin-vscode ---
[INFO] Executing tasks

main:
   [delete] Deleting directory <https://wso2.org/jenkins/job/ballerina-platform/job/ballerina/org.ballerinalang$plugin-vscode/ws/target>
[INFO] Executed tasks
[INFO] 
[INFO] --- maven-checkstyle-plugin:2.17:check (validate) @ plugin-vscode ---
[INFO] Starting audit...
Audit done.
[INFO] 
[INFO] --- buildnumber-maven-plugin:1.4:create (default) @ plugin-vscode ---
[INFO] Executing: /bin/sh -c cd '<https://wso2.org/jenkins/job/ballerina-platform/job/ballerina/org.ballerinalang$plugin-vscode/ws/'> && 'git' 'rev-parse' '--verify' 'HEAD'
[INFO] Working directory: <https://wso2.org/jenkins/job/ballerina-platform/job/ballerina/org.ballerinalang$plugin-vscode/ws/>
[INFO] Storing buildNumber: 6d40b24fd731b211bbf99cf700139982a31abdff at timestamp: 1539841715355
[WARNING] Cannot get the branch information from the git repository: 
Detecting the current branch failed: fatal: ref HEAD is not a symbolic ref

[INFO] Executing: /bin/sh -c cd '<https://wso2.org/jenkins/job/ballerina-platform/job/ballerina/org.ballerinalang$plugin-vscode/ws/'> && 'git' 'rev-parse' '--verify' 'HEAD'
[INFO] Working directory: <https://wso2.org/jenkins/job/ballerina-platform/job/ballerina/org.ballerinalang$plugin-vscode/ws/>
[INFO] Storing buildScmBranch: UNKNOWN
[INFO] 
[INFO] --- maven-antrun-plugin:1.8:run (set-npm-executable) @ plugin-vscode ---
[INFO] Executing tasks

main:
[INFO] Executed tasks
[INFO] 
[INFO] --- replacer:1.5.3:replace (replace-version) @ plugin-vscode ---
Downloading: http://maven.wso2.org/nexus/content/repositories/releases/org/apache/maven/maven-plugin-api/3.0.3/maven-plugin-api-3.0.3.pom
Downloading: http://maven.wso2.org/nexus/content/groups/wso2-public/org/apache/maven/maven-plugin-api/3.0.3/maven-plugin-api-3.0.3.pom
Downloaded: http://maven.wso2.org/nexus/content/groups/wso2-public/org/apache/maven/maven-plugin-api/3.0.3/maven-plugin-api-3.0.3.pom (3 KB at 447.3 KB/sec)
Downloading: http://maven.wso2.org/nexus/content/repositories/releases/org/apache/maven/maven/3.0.3/maven-3.0.3.pom
Downloading: http://maven.wso2.org/nexus/content/groups/wso2-public/org/apache/maven/maven/3.0.3/maven-3.0.3.pom
Downloaded: http://maven.wso2.org/nexus/content/groups/wso2-public/org/apache/maven/maven/3.0.3/maven-3.0.3.pom (23 KB at 5519.3 KB/sec)
Downloading: http://maven.wso2.org/nexus/content/repositories/releases/org/apache/maven/maven-model/3.0.3/maven-model-3.0.3.pom
Downloading: http://maven.wso2.org/nexus/content/groups/wso2-public/org/apache/maven/maven-model/3.0.3/maven-model-3.0.3.pom
Downloaded: http://maven.wso2.org/nexus/content/groups/wso2-public/org/apache/maven/maven-model/3.0.3/maven-model-3.0.3.pom (4 KB at 760.5 KB/sec)
Downloading: http://maven.wso2.org/nexus/content/repositories/releases/org/apache/maven/maven-artifact/3.0.3/maven-artifact-3.0.3.pom
Downloading: http://maven.wso2.org/nexus/content/groups/wso2-public/org/apache/maven/maven-artifact/3.0.3/maven-artifact-3.0.3.pom
Downloaded: http://maven.wso2.org/nexus/content/groups/wso2-public/org/apache/maven/maven-artifact/3.0.3/maven-artifact-3.0.3.pom (2 KB at 314.1 KB/sec)
Downloading: http://maven.wso2.org/nexus/content/repositories/releases/org/sonatype/sisu/sisu-inject-plexus/2.1.1/sisu-inject-plexus-2.1.1.pom
Downloading: http://maven.wso2.org/nexus/content/groups/wso2-public/org/sonatype/sisu/sisu-inject-plexus/2.1.1/sisu-inject-plexus-2.1.1.pom
Downloaded: http://maven.wso2.org/nexus/content/groups/wso2-public/org/sonatype/sisu/sisu-inject-plexus/2.1.1/sisu-inject-plexus-2.1.1.pom (3 KB at 734.6 KB/sec)
Downloading: http://maven.wso2.org/nexus/content/repositories/releases/org/sonatype/sisu/inject/guice-plexus/2.1.1/guice-plexus-2.1.1.pom
Downloading: http://maven.wso2.org/nexus/content/groups/wso2-public/org/sonatype/sisu/inject/guice-plexus/2.1.1/guice-plexus-2.1.1.pom
Downloaded: http://maven.wso2.org/nexus/content/groups/wso2-public/org/sonatype/sisu/inject/guice-plexus/2.1.1/guice-plexus-2.1.1.pom (4 KB at 694.3 KB/sec)
Downloading: http://maven.wso2.org/nexus/content/repositories/releases/org/sonatype/sisu/inject/guice-bean/2.1.1/guice-bean-2.1.1.pom
Downloading: http://maven.wso2.org/nexus/content/groups/wso2-public/org/sonatype/sisu/inject/guice-bean/2.1.1/guice-bean-2.1.1.pom
Downloaded: http://maven.wso2.org/nexus/content/groups/wso2-public/org/sonatype/sisu/inject/guice-bean/2.1.1/guice-bean-2.1.1.pom (3 KB at 744.6 KB/sec)
Downloading: http://maven.wso2.org/nexus/content/repositories/releases/org/sonatype/sisu/sisu-inject/2.1.1/sisu-inject-2.1.1.pom
Downloading: http://maven.wso2.org/nexus/content/groups/wso2-public/org/sonatype/sisu/sisu-inject/2.1.1/sisu-inject-2.1.1.pom
Downloaded: http://maven.wso2.org/nexus/content/groups/wso2-public/org/sonatype/sisu/sisu-inject/2.1.1/sisu-inject-2.1.1.pom (2 KB at 345.9 KB/sec)
Downloading: http://maven.wso2.org/nexus/content/repositories/releases/org/sonatype/sisu/sisu-parent/2.1.1/sisu-parent-2.1.1.pom
Downloading: http://maven.wso2.org/nexus/content/groups/wso2-public/org/sonatype/sisu/sisu-parent/2.1.1/sisu-parent-2.1.1.pom
Downloaded: http://maven.wso2.org/nexus/content/groups/wso2-public/org/sonatype/sisu/sisu-parent/2.1.1/sisu-parent-2.1.1.pom (10 KB at 2262.7 KB/sec)
Downloading: http://maven.wso2.org/nexus/content/repositories/releases/org/sonatype/forge/forge-parent/7/forge-parent-7.pom
Downloading: http://maven.wso2.org/nexus/content/groups/wso2-public/org/sonatype/forge/forge-parent/7/forge-parent-7.pom
Downloaded: http://maven.wso2.org/nexus/content/groups/wso2-public/org/sonatype/forge/forge-parent/7/forge-parent-7.pom (13 KB at 3097.9 KB/sec)
Downloading: http://maven.wso2.org/nexus/content/repositories/releases/org/sonatype/sisu/sisu-inject-bean/2.1.1/sisu-inject-bean-2.1.1.pom
Downloading: http://maven.wso2.org/nexus/content/groups/wso2-public/org/sonatype/sisu/sisu-inject-bean/2.1.1/sisu-inject-bean-2.1.1.pom
Downloaded: http://maven.wso2.org/nexus/content/groups/wso2-public/org/sonatype/sisu/sisu-inject-bean/2.1.1/sisu-inject-bean-2.1.1.pom (3 KB at 731.9 KB/sec)
Downloading: http://maven.wso2.org/nexus/content/repositories/releases/org/sonatype/sisu/sisu-guice/2.9.4/sisu-guice-2.9.4.pom
Downloading: http://maven.wso2.org/nexus/content/groups/wso2-public/org/sonatype/sisu/sisu-guice/2.9.4/sisu-guice-2.9.4.pom
Downloaded: http://maven.wso2.org/nexus/content/groups/wso2-public/org/sonatype/sisu/sisu-guice/2.9.4/sisu-guice-2.9.4.pom (8 KB at 1532.4 KB/sec)
Downloading: http://maven.wso2.org/nexus/content/repositories/releases/org/sonatype/sisu/inject/guice-parent/2.9.4/guice-parent-2.9.4.pom
Downloading: http://maven.wso2.org/nexus/content/groups/wso2-public/org/sonatype/sisu/inject/guice-parent/2.9.4/guice-parent-2.9.4.pom
Downloaded: http://maven.wso2.org/nexus/content/groups/wso2-public/org/sonatype/sisu/inject/guice-parent/2.9.4/guice-parent-2.9.4.pom (13 KB at 2530.5 KB/sec)
Downloading: http://maven.wso2.org/nexus/content/repositories/releases/org/apache/ant/ant/1.8.2/ant-1.8.2.pom
Downloading: http://maven.wso2.org/nexus/content/groups/wso2-public/org/apache/ant/ant/1.8.2/ant-1.8.2.pom
Downloaded: http://maven.wso2.org/nexus/content/groups/wso2-public/org/apache/ant/ant/1.8.2/ant-1.8.2.pom (10 KB at 2411.1 KB/sec)
Downloading: http://maven.wso2.org/nexus/content/repositories/releases/org/apache/ant/ant-parent/1.8.2/ant-parent-1.8.2.pom
Downloading: http://maven.wso2.org/nexus/content/groups/wso2-public/org/apache/ant/ant-parent/1.8.2/ant-parent-1.8.2.pom
Downloaded: http://maven.wso2.org/nexus/content/groups/wso2-public/org/apache/ant/ant-parent/1.8.2/ant-parent-1.8.2.pom (5 KB at 1144.5 KB/sec)
Downloading: http://maven.wso2.org/nexus/content/repositories/releases/org/apache/ant/ant-launcher/1.8.2/ant-launcher-1.8.2.pom
Downloading: http://maven.wso2.org/nexus/content/groups/wso2-public/org/apache/ant/ant-launcher/1.8.2/ant-launcher-1.8.2.pom
Downloaded: http://maven.wso2.org/nexus/content/groups/wso2-public/org/apache/ant/ant-launcher/1.8.2/ant-launcher-1.8.2.pom (3 KB at 590.6 KB/sec)
Downloading: http://maven.wso2.org/nexus/content/repositories/releases/xerces/xercesImpl/2.8.0/xercesImpl-2.8.0.pom
Downloading: http://maven.wso2.org/nexus/content/groups/wso2-public/xerces/xercesImpl/2.8.0/xercesImpl-2.8.0.pom
Downloaded: http://maven.wso2.org/nexus/content/groups/wso2-public/xerces/xercesImpl/2.8.0/xercesImpl-2.8.0.pom (2 KB at 343.3 KB/sec)
Downloading: http://maven.wso2.org/nexus/content/repositories/releases/org/codehaus/plexus/plexus-utils/2.0.6/plexus-utils-2.0.6.jar
Downloading: http://maven.wso2.org/nexus/content/repositories/releases/org/sonatype/sisu/sisu-inject-bean/2.1.1/sisu-inject-bean-2.1.1.jar
Downloading: http://maven.wso2.org/nexus/content/repositories/releases/org/sonatype/sisu/sisu-guice/2.9.4/sisu-guice-2.9.4-no_aop.jar
Downloading: http://maven.wso2.org/nexus/content/repositories/releases/org/apache/ant/ant/1.8.2/ant-1.8.2.jar
Downloading: http://maven.wso2.org/nexus/content/repositories/releases/org/apache/ant/ant-launcher/1.8.2/ant-launcher-1.8.2.jar
Downloading: http://maven.wso2.org/nexus/content/repositories/releases/commons-io/commons-io/2.1/commons-io-2.1.jar
Downloading: http://maven.wso2.org/nexus/content/repositories/releases/xerces/xercesImpl/2.8.0/xercesImpl-2.8.0.jar
Downloading: http://maven.wso2.org/nexus/content/repositories/releases/xml-apis/xml-apis/1.3.03/xml-apis-1.3.03.jar
Downloading: http://maven.wso2.org/nexus/content/groups/wso2-public/org/codehaus/plexus/plexus-utils/2.0.6/plexus-utils-2.0.6.jar
Downloading: http://maven.wso2.org/nexus/content/groups/wso2-public/org/sonatype/sisu/sisu-inject-bean/2.1.1/sisu-inject-bean-2.1.1.jar
Downloading: http://maven.wso2.org/nexus/content/groups/wso2-public/org/sonatype/sisu/sisu-guice/2.9.4/sisu-guice-2.9.4-no_aop.jar
Downloading: http://maven.wso2.org/nexus/content/groups/wso2-public/org/apache/ant/ant/1.8.2/ant-1.8.2.jar
Downloading: http://maven.wso2.org/nexus/content/groups/wso2-public/org/apache/ant/ant-launcher/1.8.2/ant-launcher-1.8.2.jar
Downloaded: http://maven.wso2.org/nexus/content/groups/wso2-public/org/apache/ant/ant-launcher/1.8.2/ant-launcher-1.8.2.jar (13 KB at 1504.2 KB/sec)
Downloading: http://maven.wso2.org/nexus/content/groups/wso2-public/commons-io/commons-io/2.1/commons-io-2.1.jar
Downloaded: http://maven.wso2.org/nexus/content/groups/wso2-public/org/sonatype/sisu/sisu-inject-bean/2.1.1/sisu-inject-bean-2.1.1.jar (225 KB at 28058.1 KB/sec)
Downloading: http://maven.wso2.org/nexus/content/groups/wso2-public/xerces/xercesImpl/2.8.0/xercesImpl-2.8.0.jar
Downloaded: http://maven.wso2.org/nexus/content/groups/wso2-public/org/codehaus/plexus/plexus-utils/2.0.6/plexus-utils-2.0.6.jar (219 KB at 27273.6 KB/sec)
Downloading: http://maven.wso2.org/nexus/content/groups/wso2-public/xml-apis/xml-apis/1.3.03/xml-apis-1.3.03.jar
Downloaded: http://maven.wso2.org/nexus/content/groups/wso2-public/org/sonatype/sisu/sisu-guice/2.9.4/sisu-guice-2.9.4-no_aop.jar (473 KB at 33732.8 KB/sec)
Downloaded: http://maven.wso2.org/nexus/content/groups/wso2-public/commons-io/commons-io/2.1/commons-io-2.1.jar (160 KB at 22761.0 KB/sec)
Downloaded: http://maven.wso2.org/nexus/content/groups/wso2-public/xml-apis/xml-apis/1.3.03/xml-apis-1.3.03.jar (191 KB at 23818.2 KB/sec)
Downloaded: http://maven.wso2.org/nexus/content/groups/wso2-public/org/apache/ant/ant/1.8.2/ant-1.8.2.jar (1889 KB at 75536.8 KB/sec)
Downloaded: http://maven.wso2.org/nexus/content/groups/wso2-public/xerces/xercesImpl/2.8.0/xercesImpl-2.8.0.jar (1179 KB at 49115.9 KB/sec)
[INFO] Replacement run on 1 file.
[INFO] 
[INFO] --- exec-maven-plugin:1.6.0:exec (npm-install) @ plugin-vscode ---

> ballerina at 0.982.1-SNAPSHOT postinstall <https://wso2.org/jenkins/job/ballerina-platform/job/ballerina/org.ballerinalang$plugin-vscode/ws/>
> node ./node_modules/vscode/bin/install

Detected VS Code engine version: ^1.26.1
Found minimal version that qualifies engine range: 1.26.1
Fetching vscode.d.ts from: https://raw.githubusercontent.com/Microsoft/vscode/493869ee8e8a846b0855873886fc79d480d342de/src/vs/vscode.d.ts
vscode.d.ts successfully installed!

npm WARN ballerina at 0.982.1-SNAPSHOT No license field.

added 377 packages in 5.582s
[INFO] 
[INFO] --- maven-remote-resources-plugin:1.5:process (default) @ plugin-vscode ---
[INFO] artifact org.eclipse.xtend:org.eclipse.xtend.lib: checking for updates from wso2.releases
[INFO] artifact org.eclipse.xtend:org.eclipse.xtend.lib: checking for updates from wso2-nexus
[INFO] artifact org.eclipse.xtend:org.eclipse.xtend.lib: checking for updates from 3rd-party
[INFO] artifact org.eclipse.xtend:org.eclipse.xtend.lib: checking for updates from shibboleth.internet2.edu
[INFO] artifact org.eclipse.xtend:org.eclipse.xtend.lib: checking for updates from shibboleth-release
[INFO] artifact org.eclipse.xtend:org.eclipse.xtend.lib: checking for updates from central
[INFO] 
[INFO] --- maven-dependency-plugin:2.10:unpack-dependencies (copy-distribution) @ plugin-vscode ---
[INFO] Unpacking /home/jenkins/workspace/ballerina-platform/ballerina/distribution/zip/ballerina-tools/target/ballerina-tools-0.982.1-SNAPSHOT.zip to <https://wso2.org/jenkins/job/ballerina-platform/job/ballerina/org.ballerinalang$plugin-vscode/ws/target/test> with includes "" and excludes ""
[INFO] 
[INFO] --- maven-dependency-plugin:2.10:unpack-dependencies (unpack-composer-library) @ plugin-vscode ---
[INFO] Unpacking /home/jenkins/workspace/ballerina-platform/ballerina/composer/target/composer-library-0.982.1-SNAPSHOT.zip to <https://wso2.org/jenkins/job/ballerina-platform/job/ballerina/org.ballerinalang$plugin-vscode/ws/target/composer> with includes "" and excludes ""
[INFO] 
[INFO] --- maven-antrun-plugin:1.8:run (copy-resources) @ plugin-vscode ---
[INFO] Executing tasks

copy resources:
    [mkdir] Created dir: <https://wso2.org/jenkins/job/ballerina-platform/job/ballerina/org.ballerinalang$plugin-vscode/ws/resources/composer>
     [copy] Copying 1 file to <https://wso2.org/jenkins/job/ballerina-platform/job/ballerina/org.ballerinalang$plugin-vscode/ws/resources/composer>
[INFO] Executed tasks
[INFO] 
[INFO] --- spotbugs-maven-plugin:3.1.1:spotbugs (spotbugs) @ plugin-vscode ---
[INFO] 
[INFO] --- spotbugs-maven-plugin:3.1.1:check (analyze-compile) @ plugin-vscode ---
[INFO] 
[INFO] --- exec-maven-plugin:1.6.0:exec (run tests) @ plugin-vscode ---

> ballerina at 0.982.1-SNAPSHOT test <https://wso2.org/jenkins/job/ballerina-platform/job/ballerina/org.ballerinalang$plugin-vscode/ws/>
> npm run compile && node ./node_modules/vscode/bin/test


> ballerina at 0.982.1-SNAPSHOT compile <https://wso2.org/jenkins/job/ballerina-platform/job/ballerina/org.ballerinalang$plugin-vscode/ws/>
> tsc -p ./

### VS Code Extension Test Run ###
Current working directory: <https://wso2.org/jenkins/job/ballerina-platform/job/ballerina/org.ballerinalang$plugin-vscode/ws/>
Downloading VS Code into "<https://wso2.org/jenkins/job/ballerina-platform/job/ballerina/org.ballerinalang$plugin-vscode/ws/.vscode-test/stable"> from: https://vscode-update.azurewebsites.net/1.28.2/linux-x64/stable
Running extension tests: <https://wso2.org/jenkins/job/ballerina-platform/job/ballerina/org.ballerinalang$plugin-vscode/ws/.vscode-test/stable/VSCode-linux-x64/code> <https://wso2.org/jenkins/job/ballerina-platform/job/ballerina/org.ballerinalang$plugin-vscode/ws/out/test> --extensionDevelopmentPath=<https://wso2.org/jenkins/job/ballerina-platform/job/ballerina/org.ballerinalang$plugin-vscode/ws/> --extensionTestsPath=<https://wso2.org/jenkins/job/ballerina-platform/job/ballerina/org.ballerinalang$plugin-vscode/ws/out/test>
<https://wso2.org/jenkins/job/ballerina-platform/job/ballerina/org.ballerinalang$plugin-vscode/ws/.vscode-test/stable/VSCode-linux-x64/code>: error while loading shared libraries: libXss.so.1: cannot open shared object file: No such file or directory

Tests exited with code: 127
npm ERR! file sh
npm ERR! code ELIFECYCLE
npm ERR! errno ENOENT
npm ERR! syscall spawn
npm ERR! ballerina at 0.982.1-SNAPSHOT test: `npm run compile && node ./node_modules/vscode/bin/test`
npm ERR! spawn ENOENT
npm ERR! 
npm ERR! Failed at the ballerina at 0.982.1-SNAPSHOT test script.
npm ERR! This is probably not a problem with npm. There is likely additional logging output above.

npm ERR! A complete log of this run can be found in:
npm ERR!     /root/.npm/_logs/2018-10-18T05_48_57_159Z-debug.log
[ERROR] Command execution failed.
org.apache.commons.exec.ExecuteException: Process exited with an error: 1 (Exit value: 1)
	at org.apache.commons.exec.DefaultExecutor.executeInternal(DefaultExecutor.java:404)
	at org.apache.commons.exec.DefaultExecutor.execute(DefaultExecutor.java:166)
	at org.codehaus.mojo.exec.ExecMojo.executeCommandLine(ExecMojo.java:804)
	at org.codehaus.mojo.exec.ExecMojo.executeCommandLine(ExecMojo.java:751)
	at org.codehaus.mojo.exec.ExecMojo.execute(ExecMojo.java:313)
	at org.apache.maven.plugin.DefaultBuildPluginManager.executeMojo(DefaultBuildPluginManager.java:101)
	at org.apache.maven.lifecycle.internal.MojoExecutor.execute(MojoExecutor.java:209)
	at org.apache.maven.lifecycle.internal.MojoExecutor.execute(MojoExecutor.java:153)
	at org.apache.maven.lifecycle.internal.MojoExecutor.execute(MojoExecutor.java:145)
	at org.apache.maven.lifecycle.internal.LifecycleModuleBuilder.buildProject(LifecycleModuleBuilder.java:84)
	at org.apache.maven.lifecycle.internal.LifecycleModuleBuilder.buildProject(LifecycleModuleBuilder.java:59)
	at org.apache.maven.lifecycle.internal.LifecycleStarter.singleThreadedBuild(LifecycleStarter.java:183)
	at org.apache.maven.lifecycle.internal.LifecycleStarter.execute(LifecycleStarter.java:161)
	at org.apache.maven.DefaultMaven.doExecute(DefaultMaven.java:320)
	at org.apache.maven.DefaultMaven.execute(DefaultMaven.java:156)
	at org.jvnet.hudson.maven3.launcher.Maven3Launcher.main(Maven3Launcher.java:117)
	at sun.reflect.NativeMethodAccessorImpl.invoke0(Native Method)
	at sun.reflect.NativeMethodAccessorImpl.invoke(NativeMethodAccessorImpl.java:62)
	at sun.reflect.DelegatingMethodAccessorImpl.invoke(DelegatingMethodAccessorImpl.java:43)
	at java.lang.reflect.Method.invoke(Method.java:498)
	at org.codehaus.plexus.classworlds.launcher.Launcher.launchStandard(Launcher.java:329)
	at org.codehaus.plexus.classworlds.launcher.Launcher.launch(Launcher.java:239)
	at org.jvnet.hudson.maven3.agent.Maven3Main.launch(Maven3Main.java:181)
	at sun.reflect.NativeMethodAccessorImpl.invoke0(Native Method)
	at sun.reflect.NativeMethodAccessorImpl.invoke(NativeMethodAccessorImpl.java:62)
	at sun.reflect.DelegatingMethodAccessorImpl.invoke(DelegatingMethodAccessorImpl.java:43)
	at java.lang.reflect.Method.invoke(Method.java:498)
	at hudson.maven.Maven3Builder.call(Maven3Builder.java:133)
	at hudson.maven.Maven3Builder.call(Maven3Builder.java:68)
	at hudson.remoting.UserRequest.perform(UserRequest.java:153)
	at hudson.remoting.UserRequest.perform(UserRequest.java:50)
	at hudson.remoting.Request$2.run(Request.java:336)
	at hudson.remoting.InterceptingExecutorService$1.call(InterceptingExecutorService.java:68)
	at java.util.concurrent.FutureTask.run(FutureTask.java:266)
	at java.util.concurrent.ThreadPoolExecutor.runWorker(ThreadPoolExecutor.java:1149)
	at java.util.concurrent.ThreadPoolExecutor$Worker.run(ThreadPoolExecutor.java:624)
	at java.lang.Thread.run(Thread.java:748)


More information about the Builder mailing list