[Builder] Build failed in Jenkins: extras » jaggery #2029

cbuilder at wso2.org cbuilder at wso2.org
Mon Jan 7 11:23:05 PST 2019


See <https://wso2.org/jenkins/job/extras/job/jaggery/2029/display/redirect>

------------------------------------------
[...truncated 218.65 KB...]

-------------------------------------------------------
 T E S T S
-------------------------------------------------------

Results :

Tests run: 0, Failures: 0, Errors: 0, Skipped: 0

[JENKINS] Recording test results[INFO] 
[INFO] --- maven-bundle-plugin:2.3.5:bundle (default-bundle) @ org.jaggeryjs.scriptengine ---

[INFO] 
[INFO] --- maven-install-plugin:2.5.2:install (default-install) @ org.jaggeryjs.scriptengine ---
[INFO] Installing <https://wso2.org/jenkins/job/extras/job/jaggery/ws/components/script-engine/org.jaggeryjs.scriptengine/target/org.jaggeryjs.scriptengine-0.13.1-SNAPSHOT.jar> to <https://wso2.org/jenkins/job/extras/job/jaggery/ws/.repository/org/jaggeryjs/org.jaggeryjs.scriptengine/0.13.1-SNAPSHOT/org.jaggeryjs.scriptengine-0.13.1-SNAPSHOT.jar>
[INFO] Installing <https://wso2.org/jenkins/job/extras/job/jaggery/ws/components/script-engine/org.jaggeryjs.scriptengine/pom.xml> to <https://wso2.org/jenkins/job/extras/job/jaggery/ws/.repository/org/jaggeryjs/org.jaggeryjs.scriptengine/0.13.1-SNAPSHOT/org.jaggeryjs.scriptengine-0.13.1-SNAPSHOT.pom>
[INFO] 
[INFO] --- maven-bundle-plugin:2.3.5:install (default-install) @ org.jaggeryjs.scriptengine ---
[INFO] Local OBR update disabled (enable with -DobrRepository)
[INFO]                                                                         
[INFO] ------------------------------------------------------------------------
[INFO] Building WSO2 Carbon - Hostobjects Aggregator Module 0.13.1-SNAPSHOT
[INFO] ------------------------------------------------------------------------
[INFO] 
[INFO] --- maven-clean-plugin:2.6.1:clean (default-clean) @ hostobjects ---
[INFO] 
[INFO] --- maven-remote-resources-plugin:1.5:process (default) @ hostobjects ---
[INFO] 
[INFO] --- maven-install-plugin:2.5.2:install (default-install) @ hostobjects ---
[INFO] Installing <https://wso2.org/jenkins/job/extras/job/jaggery/ws/components/hostobjects/pom.xml> to <https://wso2.org/jenkins/job/extras/job/jaggery/ws/.repository/org/jaggeryjs/hostobjects/0.13.1-SNAPSHOT/hostobjects-0.13.1-SNAPSHOT.pom>
[INFO]                                                                         
[INFO] ------------------------------------------------------------------------
[INFO] Building Stream HostObject 0.13.1-SNAPSHOT
[INFO] ------------------------------------------------------------------------
[INFO] 
[INFO] --- maven-clean-plugin:2.6.1:clean (default-clean) @ org.jaggeryjs.hostobjects.stream ---
[INFO] 
[INFO] --- maven-remote-resources-plugin:1.5:process (default) @ org.jaggeryjs.hostobjects.stream ---
[INFO] 
[INFO] --- maven-resources-plugin:2.5:resources (default-resources) @ org.jaggeryjs.hostobjects.stream ---
[debug] execute contextualize
[INFO] Using 'UTF-8' encoding to copy filtered resources.
[INFO] skip non existing resourceDirectory <https://wso2.org/jenkins/job/extras/job/jaggery/ws/components/hostobjects/org.jaggeryjs.hostobjects.stream/src/main/resources>
[INFO] Copying 3 resources
[INFO] 
[INFO] --- maven-compiler-plugin:3.1:compile (default-compile) @ org.jaggeryjs.hostobjects.stream ---
[INFO] Changes detected - recompiling the module!
[INFO] Compiling 1 source file to <https://wso2.org/jenkins/job/extras/job/jaggery/ws/components/hostobjects/org.jaggeryjs.hostobjects.stream/target/classes>
[INFO] 
[INFO] --- maven-scr-plugin:1.7.2:scr (generate-scr-scrdescriptor) @ org.jaggeryjs.hostobjects.stream ---
[INFO] 
[INFO] --- maven-resources-plugin:2.5:testResources (default-testResources) @ org.jaggeryjs.hostobjects.stream ---
[debug] execute contextualize
[INFO] Using 'UTF-8' encoding to copy filtered resources.
[INFO] skip non existing resourceDirectory <https://wso2.org/jenkins/job/extras/job/jaggery/ws/components/hostobjects/org.jaggeryjs.hostobjects.stream/src/test/resources>
[INFO] Copying 3 resources
[INFO] 
[INFO] --- maven-compiler-plugin:3.1:testCompile (default-testCompile) @ org.jaggeryjs.hostobjects.stream ---
[INFO] No sources to compile
[INFO] 
[INFO] --- maven-surefire-plugin:2.12:test (default-test) @ org.jaggeryjs.hostobjects.stream ---
[INFO] Surefire report directory: <https://wso2.org/jenkins/job/extras/job/jaggery/ws/components/hostobjects/org.jaggeryjs.hostobjects.stream/target/surefire-reports>

-------------------------------------------------------
 T E S T S
-------------------------------------------------------

Results :

Tests run: 0, Failures: 0, Errors: 0, Skipped: 0

[JENKINS] Recording test results[INFO] 
[INFO] --- maven-bundle-plugin:2.3.5:bundle (default-bundle) @ org.jaggeryjs.hostobjects.stream ---

[WARNING] Embed-Dependency: clause "httpcore-nio;scope=compile|runtime;inline=false" did not match any dependencies
[WARNING] Embed-Dependency: clause "httpcore;scope=compile|runtime;inline=false" did not match any dependencies
[INFO] 
[INFO] --- maven-install-plugin:2.5.2:install (default-install) @ org.jaggeryjs.hostobjects.stream ---
[INFO] Installing <https://wso2.org/jenkins/job/extras/job/jaggery/ws/components/hostobjects/org.jaggeryjs.hostobjects.stream/target/org.jaggeryjs.hostobjects.stream-0.13.1-SNAPSHOT.jar> to <https://wso2.org/jenkins/job/extras/job/jaggery/ws/.repository/org/jaggeryjs/org.jaggeryjs.hostobjects.stream/0.13.1-SNAPSHOT/org.jaggeryjs.hostobjects.stream-0.13.1-SNAPSHOT.jar>
[INFO] Installing <https://wso2.org/jenkins/job/extras/job/jaggery/ws/components/hostobjects/org.jaggeryjs.hostobjects.stream/pom.xml> to <https://wso2.org/jenkins/job/extras/job/jaggery/ws/.repository/org/jaggeryjs/org.jaggeryjs.hostobjects.stream/0.13.1-SNAPSHOT/org.jaggeryjs.hostobjects.stream-0.13.1-SNAPSHOT.pom>
[INFO] 
[INFO] --- maven-bundle-plugin:2.3.5:install (default-install) @ org.jaggeryjs.hostobjects.stream ---
[INFO] Local OBR update disabled (enable with -DobrRepository)
[INFO]                                                                         
[INFO] ------------------------------------------------------------------------
[INFO] Building File HostObject 0.13.1-SNAPSHOT
[INFO] ------------------------------------------------------------------------
Downloading: https://maven.wso2.org/nexus/content/repositories/releases/commons-fileupload/wso2/commons-fileupload/1.2.2.wso2v1/commons-fileupload-1.2.2.wso2v1.pom
Downloading: https://maven.wso2.org/nexus/content/groups/wso2-public/commons-fileupload/wso2/commons-fileupload/1.2.2.wso2v1/commons-fileupload-1.2.2.wso2v1.pom
Downloaded: https://maven.wso2.org/nexus/content/groups/wso2-public/commons-fileupload/wso2/commons-fileupload/1.2.2.wso2v1/commons-fileupload-1.2.2.wso2v1.pom (3 KB at 40.3 KB/sec)
Downloading: https://maven.wso2.org/nexus/content/repositories/releases/commons-fileupload/commons-fileupload/1.2.2/commons-fileupload-1.2.2.pom
Downloading: https://maven.wso2.org/nexus/content/groups/wso2-public/commons-fileupload/commons-fileupload/1.2.2/commons-fileupload-1.2.2.pom
Downloaded: https://maven.wso2.org/nexus/content/groups/wso2-public/commons-fileupload/commons-fileupload/1.2.2/commons-fileupload-1.2.2.pom (9 KB at 157.4 KB/sec)
Downloading: https://maven.wso2.org/nexus/content/repositories/releases/org/apache/commons/commons-parent/16/commons-parent-16.pom
Downloading: https://maven.wso2.org/nexus/content/groups/wso2-public/org/apache/commons/commons-parent/16/commons-parent-16.pom
Downloaded: https://maven.wso2.org/nexus/content/groups/wso2-public/org/apache/commons/commons-parent/16/commons-parent-16.pom (30 KB at 525.2 KB/sec)
Downloading: https://maven.wso2.org/nexus/content/repositories/releases/org/eclipse/equinox/javax.servlet.jsp/2.0.0.v200806031607/javax.servlet.jsp-2.0.0.v200806031607.pom
Downloading: https://maven.wso2.org/nexus/content/groups/wso2-public/org/eclipse/equinox/javax.servlet.jsp/2.0.0.v200806031607/javax.servlet.jsp-2.0.0.v200806031607.pom
Downloading: https://maven.wso2.org/nexus/content/repositories/thirdparty/org/eclipse/equinox/javax.servlet.jsp/2.0.0.v200806031607/javax.servlet.jsp-2.0.0.v200806031607.pom
Downloading: https://build.shibboleth.net/nexus/content/groups/public/org/eclipse/equinox/javax.servlet.jsp/2.0.0.v200806031607/javax.servlet.jsp-2.0.0.v200806031607.pom
Downloading: https://build.shibboleth.net/nexus/content/groups/public/org/eclipse/equinox/javax.servlet.jsp/2.0.0.v200806031607/javax.servlet.jsp-2.0.0.v200806031607.pom
Downloading: http://repo.maven.apache.org/maven2/org/eclipse/equinox/javax.servlet.jsp/2.0.0.v200806031607/javax.servlet.jsp-2.0.0.v200806031607.pom
Downloading: https://maven.wso2.org/nexus/content/repositories/releases/org/wso2/carbon/javax.servlet/3.0.0.wso2v1/javax.servlet-3.0.0.wso2v1.pom
Downloading: https://maven.wso2.org/nexus/content/groups/wso2-public/org/wso2/carbon/javax.servlet/3.0.0.wso2v1/javax.servlet-3.0.0.wso2v1.pom
Downloaded: https://maven.wso2.org/nexus/content/groups/wso2-public/org/wso2/carbon/javax.servlet/3.0.0.wso2v1/javax.servlet-3.0.0.wso2v1.pom (3 KB at 25.1 KB/sec)
Downloading: https://maven.wso2.org/nexus/content/repositories/releases/org/apache/tomcat/tomcat-servlet-api/7.0.21/tomcat-servlet-api-7.0.21.pom
Downloading: https://maven.wso2.org/nexus/content/groups/wso2-public/org/apache/tomcat/tomcat-servlet-api/7.0.21/tomcat-servlet-api-7.0.21.pom
Downloaded: https://maven.wso2.org/nexus/content/groups/wso2-public/org/apache/tomcat/tomcat-servlet-api/7.0.21/tomcat-servlet-api-7.0.21.pom (2 KB at 18.7 KB/sec)
Downloading: https://maven.wso2.org/nexus/content/repositories/releases/javax/activation/activation/1.1/activation-1.1.pom
Downloading: https://maven.wso2.org/nexus/content/groups/wso2-public/javax/activation/activation/1.1/activation-1.1.pom
Downloaded: https://maven.wso2.org/nexus/content/groups/wso2-public/javax/activation/activation/1.1/activation-1.1.pom (2 KB at 19.9 KB/sec)
Downloading: https://maven.wso2.org/nexus/content/repositories/releases/com/google/code/findbugs/findbugs/3.0.1/findbugs-3.0.1.pom
Downloading: https://maven.wso2.org/nexus/content/groups/wso2-public/com/google/code/findbugs/findbugs/3.0.1/findbugs-3.0.1.pom
Downloaded: https://maven.wso2.org/nexus/content/groups/wso2-public/com/google/code/findbugs/findbugs/3.0.1/findbugs-3.0.1.pom (11 KB at 198.4 KB/sec)
Downloading: https://maven.wso2.org/nexus/content/repositories/releases/net/jcip/jcip-annotations/1.0/jcip-annotations-1.0.pom
Downloading: https://maven.wso2.org/nexus/content/groups/wso2-public/net/jcip/jcip-annotations/1.0/jcip-annotations-1.0.pom
Downloaded: https://maven.wso2.org/nexus/content/groups/wso2-public/net/jcip/jcip-annotations/1.0/jcip-annotations-1.0.pom (491 B at 9.0 KB/sec)
Downloading: https://maven.wso2.org/nexus/content/repositories/releases/com/google/code/findbugs/bcel-findbugs/6.0/bcel-findbugs-6.0.pom
Downloading: https://maven.wso2.org/nexus/content/groups/wso2-public/com/google/code/findbugs/bcel-findbugs/6.0/bcel-findbugs-6.0.pom
Downloaded: https://maven.wso2.org/nexus/content/groups/wso2-public/com/google/code/findbugs/bcel-findbugs/6.0/bcel-findbugs-6.0.pom (4 KB at 72.3 KB/sec)
Downloading: https://maven.wso2.org/nexus/content/repositories/releases/com/google/code/findbugs/jFormatString/2.0.1/jFormatString-2.0.1.pom
Downloading: https://maven.wso2.org/nexus/content/groups/wso2-public/com/google/code/findbugs/jFormatString/2.0.1/jFormatString-2.0.1.pom
Downloaded: https://maven.wso2.org/nexus/content/groups/wso2-public/com/google/code/findbugs/jFormatString/2.0.1/jFormatString-2.0.1.pom (950 B at 15.5 KB/sec)
Downloading: https://maven.wso2.org/nexus/content/repositories/releases/org/ow2/asm/asm-debug-all/5.0.2/asm-debug-all-5.0.2.pom
Downloading: https://maven.wso2.org/nexus/content/groups/wso2-public/org/ow2/asm/asm-debug-all/5.0.2/asm-debug-all-5.0.2.pom
Downloaded: https://maven.wso2.org/nexus/content/groups/wso2-public/org/ow2/asm/asm-debug-all/5.0.2/asm-debug-all-5.0.2.pom (2 KB at 36.5 KB/sec)
Downloading: https://maven.wso2.org/nexus/content/repositories/releases/org/ow2/asm/asm-parent/5.0.2/asm-parent-5.0.2.pom
Downloading: https://maven.wso2.org/nexus/content/groups/wso2-public/org/ow2/asm/asm-parent/5.0.2/asm-parent-5.0.2.pom
Downloaded: https://maven.wso2.org/nexus/content/groups/wso2-public/org/ow2/asm/asm-parent/5.0.2/asm-parent-5.0.2.pom (6 KB at 101.2 KB/sec)
Downloading: https://maven.wso2.org/nexus/content/repositories/releases/org/ow2/ow2/1.3/ow2-1.3.pom
Downloading: https://maven.wso2.org/nexus/content/groups/wso2-public/org/ow2/ow2/1.3/ow2-1.3.pom
Downloaded: https://maven.wso2.org/nexus/content/groups/wso2-public/org/ow2/ow2/1.3/ow2-1.3.pom (10 KB at 175.2 KB/sec)
Downloading: https://maven.wso2.org/nexus/content/repositories/releases/org/ow2/asm/asm-commons/5.0.2/asm-commons-5.0.2.pom
Downloading: https://maven.wso2.org/nexus/content/groups/wso2-public/org/ow2/asm/asm-commons/5.0.2/asm-commons-5.0.2.pom
Downloaded: https://maven.wso2.org/nexus/content/groups/wso2-public/org/ow2/asm/asm-commons/5.0.2/asm-commons-5.0.2.pom (3 KB at 37.2 KB/sec)
Downloading: https://maven.wso2.org/nexus/content/repositories/releases/org/ow2/asm/asm-tree/5.0.2/asm-tree-5.0.2.pom
Downloading: https://maven.wso2.org/nexus/content/groups/wso2-public/org/ow2/asm/asm-tree/5.0.2/asm-tree-5.0.2.pom
Downloaded: https://maven.wso2.org/nexus/content/groups/wso2-public/org/ow2/asm/asm-tree/5.0.2/asm-tree-5.0.2.pom (3 KB at 37.0 KB/sec)
Downloading: https://maven.wso2.org/nexus/content/repositories/releases/org/ow2/asm/asm/5.0.2/asm-5.0.2.pom
Downloading: https://maven.wso2.org/nexus/content/groups/wso2-public/org/ow2/asm/asm/5.0.2/asm-5.0.2.pom
Downloaded: https://maven.wso2.org/nexus/content/groups/wso2-public/org/ow2/asm/asm/5.0.2/asm-5.0.2.pom (2 KB at 36.3 KB/sec)
Downloading: https://maven.wso2.org/nexus/content/repositories/releases/commons-lang/commons-lang/2.6/commons-lang-2.6.pom
Downloading: https://maven.wso2.org/nexus/content/groups/wso2-public/commons-lang/commons-lang/2.6/commons-lang-2.6.pom
Downloaded: https://maven.wso2.org/nexus/content/groups/wso2-public/commons-lang/commons-lang/2.6/commons-lang-2.6.pom (18 KB at 322.3 KB/sec)
Downloading: https://maven.wso2.org/nexus/content/repositories/releases/org/apache/commons/commons-parent/17/commons-parent-17.pom
Downloading: https://maven.wso2.org/nexus/content/groups/wso2-public/org/apache/commons/commons-parent/17/commons-parent-17.pom
Downloaded: https://maven.wso2.org/nexus/content/groups/wso2-public/org/apache/commons/commons-parent/17/commons-parent-17.pom (31 KB at 574.6 KB/sec)
Downloading: https://maven.wso2.org/nexus/content/repositories/releases/com/apple/AppleJavaExtensions/1.4/AppleJavaExtensions-1.4.pom
Downloading: https://maven.wso2.org/nexus/content/groups/wso2-public/com/apple/AppleJavaExtensions/1.4/AppleJavaExtensions-1.4.pom
Downloaded: https://maven.wso2.org/nexus/content/groups/wso2-public/com/apple/AppleJavaExtensions/1.4/AppleJavaExtensions-1.4.pom (6 KB at 105.6 KB/sec)
Downloading: https://maven.wso2.org/nexus/content/repositories/releases/jaxen/jaxen/1.1.6/jaxen-1.1.6.pom
Downloading: https://maven.wso2.org/nexus/content/groups/wso2-public/jaxen/jaxen/1.1.6/jaxen-1.1.6.pom
Downloaded: https://maven.wso2.org/nexus/content/groups/wso2-public/jaxen/jaxen/1.1.6/jaxen-1.1.6.pom (14 KB at 250.6 KB/sec)
[BFA] Scanning build for known causes...
[BFA] No failure causes found
[BFA] Done. 0s
[INFO] ------------------------------------------------------------------------
[INFO] Reactor Summary:
[INFO] 
[INFO] jaggeryjs - Parent ................................ SUCCESS [5.236s]
[INFO] Jaggery components parent ......................... SUCCESS [0.049s]
[INFO] WSO2 Carbon - Script engine Aggregator Module ..... SUCCESS [0.035s]
[INFO] Rhino JavaScript Engine ........................... SUCCESS [11.422s]
[INFO] WSO2 Carbon - Hostobjects Aggregator Module ....... SUCCESS [0.042s]
[INFO] Stream HostObject ................................. SUCCESS [1.078s]
[INFO] File HostObject ................................... FAILURE [2.978s]
[INFO] Database HostObject ............................... SKIPPED
[INFO] Log HostObjects ................................... SKIPPED
[INFO] Web HostObjects ................................... SKIPPED
[INFO] Registry HostObject ............................... SKIPPED
[INFO] XMLHttpRequest HostObject ......................... SKIPPED
[INFO] XSLT HostObject ................................... SKIPPED
[INFO] OAuth HostObject .................................. SKIPPED
[INFO] Feed HostObject ................................... SKIPPED
[INFO] URI HostObjects ................................... SKIPPED
[INFO] JaggeryParser HostObject .......................... SKIPPED
[INFO] jaggery - Aggregator Module ....................... SKIPPED
[INFO] jaggery - Core .................................... SKIPPED
[INFO] WSO2 Carbon - Jaggery Management BE ............... SKIPPED
[INFO] WSO2 Jaggery Deployer ............................. SKIPPED
[INFO] jaggery - Tools ................................... SKIPPED
[INFO] Jaggery app Management Stub ....................... SKIPPED
[INFO] Jaggery Management UI ............................. SKIPPED
[INFO] WSO2 Jaggery- App Listeners Module ................ SKIPPED
[INFO] App Listeners ..................................... SKIPPED
[INFO] WSO2 Jaggery Server - Features Aggregator Module .. SKIPPED
[INFO] Jaggery Server Feature ............................ SKIPPED
[INFO] Jaggery Management UI Feature ..................... SKIPPED
[INFO] Jaggery aggregate Feature ......................... SKIPPED
[INFO] ------------------------------------------------------------------------
[INFO] BUILD FAILURE
[INFO] ------------------------------------------------------------------------
[INFO] Total time: 27.817s
[INFO] Finished at: Mon Jan 07 19:22:50 UTC 2019
[INFO] Final Memory: 35M/333M
[INFO] ------------------------------------------------------------------------
Waiting for Jenkins to finish collecting data
[ERROR] Failed to execute goal on project org.jaggeryjs.hostobjects.file: Could not resolve dependencies for project org.jaggeryjs:org.jaggeryjs.hostobjects.file:bundle:0.13.1-SNAPSHOT: Failed to collect dependencies for [org.jaggeryjs:org.jaggeryjs.scriptengine:jar:0.13.1-SNAPSHOT (compile), org.jaggeryjs:org.jaggeryjs.hostobjects.stream:jar:0.13.1-SNAPSHOT (compile), commons-logging:commons-logging:jar:1.1.1 (compile), commons-io.wso2:commons-io:jar:2.0.0.wso2v1 (compile), rhino.wso2:js:jar:1.7.0.R4.wso2v1 (compile), commons-fileupload.wso2:commons-fileupload:jar:1.2.2.wso2v1 (compile), org.eclipse.equinox:javax.servlet.jsp:jar:2.0.0.v200806031607 (compile), org.wso2.carbon:javax.servlet:jar:3.0.0.wso2v1 (compile), org.wso2.carbon:org.wso2.carbon.utils:jar:4.4.6 (compile), javax.activation:activation:jar:1.1 (compile), com.google.code.findbugs:findbugs:jar:3.0.1 (compile)]: Failed to read artifact descriptor for org.eclipse.equinox:javax.servlet.jsp:jar:2.0.0.v200806031607: Could not transfer artifact org.eclipse.equinox:javax.servlet.jsp:pom:2.0.0.v200806031607 from/to shibboleth.internet2.edu (https://build.shibboleth.net/nexus/content/groups/public/): peer not authenticated -> [Help 1]
[ERROR] 
[ERROR] To see the full stack trace of the errors, re-run Maven with the -e switch.
[ERROR] Re-run Maven using the -X switch to enable full debug logging.
[ERROR] 
[ERROR] For more information about the errors and possible solutions, please read the following articles:
[ERROR] [Help 1] http://cwiki.apache.org/confluence/display/MAVEN/DependencyResolutionException
[ERROR] 
[ERROR] After correcting the problems, you can resume the build with the command
[ERROR]   mvn <goals> -rf :org.jaggeryjs.hostobjects.file
[JENKINS] Archiving <https://wso2.org/jenkins/job/extras/job/jaggery/ws/components/hostobjects/org.jaggeryjs.hostobjects.registry/pom.xml> to org.jaggeryjs/org.jaggeryjs.hostobjects.registry/0.13.1-SNAPSHOT/org.jaggeryjs.hostobjects.registry-0.13.1-SNAPSHOT.pom
[JENKINS] Archiving <https://wso2.org/jenkins/job/extras/job/jaggery/ws/components/jaggery-core/org.jaggeryjs.jaggery.deployer/pom.xml> to org.jaggeryjs/org.jaggeryjs.jaggery.deployer/0.13.1-SNAPSHOT/org.jaggeryjs.jaggery.deployer-0.13.1-SNAPSHOT.pom
[JENKINS] Archiving <https://wso2.org/jenkins/job/extras/job/jaggery/ws/components/hostobjects/org.jaggeryjs.hostobjects.log/pom.xml> to org.jaggeryjs/org.jaggeryjs.hostobjects.log/0.13.1-SNAPSHOT/org.jaggeryjs.hostobjects.log-0.13.1-SNAPSHOT.pom
[JENKINS] Archiving <https://wso2.org/jenkins/job/extras/job/jaggery/ws/components/jaggery-core/pom.xml> to org.jaggeryjs/jaggery-core/0.13.1-SNAPSHOT/jaggery-core-0.13.1-SNAPSHOT.pom
[JENKINS] Archiving <https://wso2.org/jenkins/job/extras/job/jaggery/ws/components/hostobjects/org.jaggeryjs.hostobjects.xhr/pom.xml> to org.jaggeryjs/org.jaggeryjs.hostobjects.xhr/0.13.1-SNAPSHOT/org.jaggeryjs.hostobjects.xhr-0.13.1-SNAPSHOT.pom
[JENKINS] Archiving <https://wso2.org/jenkins/job/extras/job/jaggery/ws/components/hostobjects/org.jaggeryjs.hostobjects.stream/pom.xml> to org.jaggeryjs/org.jaggeryjs.hostobjects.stream/0.13.1-SNAPSHOT/org.jaggeryjs.hostobjects.stream-0.13.1-SNAPSHOT.pom
[JENKINS] Archiving <https://wso2.org/jenkins/job/extras/job/jaggery/ws/components/hostobjects/org.jaggeryjs.hostobjects.stream/target/org.jaggeryjs.hostobjects.stream-0.13.1-SNAPSHOT.jar> to org.jaggeryjs/org.jaggeryjs.hostobjects.stream/0.13.1-SNAPSHOT/org.jaggeryjs.hostobjects.stream-0.13.1-SNAPSHOT.jar
[JENKINS] Archiving <https://wso2.org/jenkins/job/extras/job/jaggery/ws/components/hostobjects/org.jaggeryjs.hostobjects.db/pom.xml> to org.jaggeryjs/org.jaggeryjs.hostobjects.db/0.13.1-SNAPSHOT/org.jaggeryjs.hostobjects.db-0.13.1-SNAPSHOT.pom
[JENKINS] Archiving <https://wso2.org/jenkins/job/extras/job/jaggery/ws/components/hostobjects/org.jaggeryjs.hostobjects.feed/pom.xml> to org.jaggeryjs/org.jaggeryjs.hostobjects.feed/0.13.1-SNAPSHOT/org.jaggeryjs.hostobjects.feed-0.13.1-SNAPSHOT.pom
[JENKINS] Archiving <https://wso2.org/jenkins/job/extras/job/jaggery/ws/components/hostobjects/org.jaggeryjs.hostobjects.oauth/pom.xml> to org.jaggeryjs/org.jaggeryjs.hostobjects.oauth/0.13.1-SNAPSHOT/org.jaggeryjs.hostobjects.oauth-0.13.1-SNAPSHOT.pom
[JENKINS] Archiving <https://wso2.org/jenkins/job/extras/job/jaggery/ws/components/hostobjects/org.jaggeryjs.hostobjects.jaggeryparser/pom.xml> to org.jaggeryjs/org.jaggeryjs.hostobjects.jaggeryparser/0.13.1-SNAPSHOT/org.jaggeryjs.hostobjects.jaggeryparser-0.13.1-SNAPSHOT.pom
[JENKINS] Archiving <https://wso2.org/jenkins/job/extras/job/jaggery/ws/components/script-engine/pom.xml> to org.jaggeryjs/script-engine/0.13.1-SNAPSHOT/script-engine-0.13.1-SNAPSHOT.pom
[JENKINS] Archiving <https://wso2.org/jenkins/job/extras/job/jaggery/ws/components/hostobjects/pom.xml> to org.jaggeryjs/hostobjects/0.13.1-SNAPSHOT/hostobjects-0.13.1-SNAPSHOT.pom
[JENKINS] Archiving <https://wso2.org/jenkins/job/extras/job/jaggery/ws/components/hostobjects/org.jaggeryjs.hostobjects.uri/pom.xml> to org.jaggeryjs/org.jaggeryjs.hostobjects.uri/0.13.1-SNAPSHOT/org.jaggeryjs.hostobjects.uri-0.13.1-SNAPSHOT.pom
[JENKINS] Archiving <https://wso2.org/jenkins/job/extras/job/jaggery/ws/features/org.jaggeryjs.feature/pom.xml> to org.jaggeryjs/org.jaggeryjs.feature/0.13.1-SNAPSHOT/org.jaggeryjs.feature-0.13.1-SNAPSHOT.pom
[JENKINS] Archiving <https://wso2.org/jenkins/job/extras/job/jaggery/ws/features/pom.xml> to org.jaggeryjs/features/0.13.1-SNAPSHOT/features-0.13.1-SNAPSHOT.pom
[JENKINS] Archiving <https://wso2.org/jenkins/job/extras/job/jaggery/ws/components/jaggery-core/org.jaggeryjs.jaggery.tools/pom.xml> to org.jaggeryjs/org.jaggeryjs.jaggery.tools/0.13.1-SNAPSHOT/org.jaggeryjs.jaggery.tools-0.13.1-SNAPSHOT.pom
[JENKINS] Archiving <https://wso2.org/jenkins/job/extras/job/jaggery/ws/features/org.jaggeryjs.server.feature/pom.xml> to org.jaggeryjs/org.jaggeryjs.server.feature/0.13.1-SNAPSHOT/org.jaggeryjs.server.feature-0.13.1-SNAPSHOT.pom
[JENKINS] Archiving <https://wso2.org/jenkins/job/extras/job/jaggery/ws/components/jaggery-core/org.jaggeryjs.jaggery.app.mgt/pom.xml> to org.jaggeryjs/org.jaggeryjs.jaggery.app.mgt/0.13.1-SNAPSHOT/org.jaggeryjs.jaggery.app.mgt-0.13.1-SNAPSHOT.pom
[JENKINS] Archiving <https://wso2.org/jenkins/job/extras/job/jaggery/ws/components/jaggery-core/org.jaggeryjs.jaggery.app.mgt.stub/pom.xml> to org.jaggeryjs/org.jaggeryjs.jaggery.app.mgt.stub/0.13.1-SNAPSHOT/org.jaggeryjs.jaggery.app.mgt.stub-0.13.1-SNAPSHOT.pom
[JENKINS] Archiving <https://wso2.org/jenkins/job/extras/job/jaggery/ws/components/app-listeners/pom.xml> to org.jaggeryjs/app-listeners/0.13.1-SNAPSHOT/app-listeners-0.13.1-SNAPSHOT.pom
[JENKINS] Archiving <https://wso2.org/jenkins/job/extras/job/jaggery/ws/components/script-engine/org.jaggeryjs.scriptengine/pom.xml> to org.jaggeryjs/org.jaggeryjs.scriptengine/0.13.1-SNAPSHOT/org.jaggeryjs.scriptengine-0.13.1-SNAPSHOT.pom
[JENKINS] Archiving <https://wso2.org/jenkins/job/extras/job/jaggery/ws/components/script-engine/org.jaggeryjs.scriptengine/target/org.jaggeryjs.scriptengine-0.13.1-SNAPSHOT.jar> to org.jaggeryjs/org.jaggeryjs.scriptengine/0.13.1-SNAPSHOT/org.jaggeryjs.scriptengine-0.13.1-SNAPSHOT.jar
[JENKINS] Archiving <https://wso2.org/jenkins/job/extras/job/jaggery/ws/components/pom.xml> to org.jaggeryjs/components/0.13.1-SNAPSHOT/components-0.13.1-SNAPSHOT.pom
[JENKINS] Archiving <https://wso2.org/jenkins/job/extras/job/jaggery/ws/components/hostobjects/org.jaggeryjs.hostobjects.xslt/pom.xml> to org.jaggeryjs/org.jaggeryjs.hostobjects.xslt/0.13.1-SNAPSHOT/org.jaggeryjs.hostobjects.xslt-0.13.1-SNAPSHOT.pom
[JENKINS] Archiving <https://wso2.org/jenkins/job/extras/job/jaggery/ws/pom.xml> to org.jaggeryjs/jaggery-parent/0.13.1-SNAPSHOT/jaggery-parent-0.13.1-SNAPSHOT.pom
[JENKINS] Archiving <https://wso2.org/jenkins/job/extras/job/jaggery/ws/components/jaggery-core/org.jaggeryjs.jaggery.core/pom.xml> to org.jaggeryjs/org.jaggeryjs.jaggery.core/0.13.1-SNAPSHOT/org.jaggeryjs.jaggery.core-0.13.1-SNAPSHOT.pom
[JENKINS] Archiving <https://wso2.org/jenkins/job/extras/job/jaggery/ws/components/hostobjects/org.jaggeryjs.hostobjects.file/pom.xml> to org.jaggeryjs/org.jaggeryjs.hostobjects.file/0.13.1-SNAPSHOT/org.jaggeryjs.hostobjects.file-0.13.1-SNAPSHOT.pom
[JENKINS] Archiving <https://wso2.org/jenkins/job/extras/job/jaggery/ws/components/hostobjects/org.jaggeryjs.hostobjects.web/pom.xml> to org.jaggeryjs/org.jaggeryjs.hostobjects.web/0.13.1-SNAPSHOT/org.jaggeryjs.hostobjects.web-0.13.1-SNAPSHOT.pom
[JENKINS] Archiving <https://wso2.org/jenkins/job/extras/job/jaggery/ws/components/app-listeners/org.jaggeryjs.jaggery.tomcat.listener/pom.xml> to org.jaggeryjs/org.jaggeryjs.jaggery.tomcat.listener/0.13.1-SNAPSHOT/org.jaggeryjs.jaggery.tomcat.listener-0.13.1-SNAPSHOT.pom
[JENKINS] Archiving <https://wso2.org/jenkins/job/extras/job/jaggery/ws/components/jaggery-core/org.jaggeryjs.jaggery.app.mgt.ui/pom.xml> to org.jaggeryjs/org.jaggeryjs.jaggery.app.mgt.ui/0.13.1-SNAPSHOT/org.jaggeryjs.jaggery.app.mgt.ui-0.13.1-SNAPSHOT.pom
[JENKINS] Archiving <https://wso2.org/jenkins/job/extras/job/jaggery/ws/features/org.jaggeryjs.ui.feature/pom.xml> to org.jaggeryjs/org.jaggeryjs.ui.feature/0.13.1-SNAPSHOT/org.jaggeryjs.ui.feature-0.13.1-SNAPSHOT.pom
Sending e-mails to: builder at wso2.org
executing script 'Script - Kill Carbon Servers'
channel stopped
[jaggery] $ /bin/bash /tmp/build_step_template1703829604920697042.sh
Running port and java processes validation has become successful.
[BFA] Scanning build for known causes...
[BFA] Found failure cause(s):
[BFA] Could not resolve dependencies from category DependencyIssue
[BFA] Failed to read artifact descriptor from category DependencyIssue
[BFA] Done. 0s


More information about the Builder mailing list