[Builder] Build failed in Jenkins: platform-builds » carbon-apimgt » WSO2 Carbon - API Management Aggregator POM #3090

cbuilder at wso2.org cbuilder at wso2.org
Thu Oct 24 04:53:44 PDT 2019


See <https://wso2.org/jenkins/job/platform-builds/job/carbon-apimgt/org.wso2.carbon.apimgt$carbon-apimgt/3090/display/redirect>

------------------------------------------
[...truncated 2.26 MB...]
[INFO] 	at org.apache.maven.surefire.booter.ForkedBooter.runSuitesInProcess(ForkedBooter.java:155)
[INFO] 	at org.apache.maven.surefire.booter.ForkedBooter.main(ForkedBooter.java:103)
[INFO] [main] ERROR org.wso2.carbon.apimgt.impl.workflow.ApplicationCreationWSWorkflowExecutor - Error converting String to OMElement
[INFO] javax.xml.stream.XMLStreamException: Error converting String to OMElement
[INFO] 	at org.powermock.core.MockGateway.doMethodCall(MockGateway.java:182)
[INFO] 	at org.powermock.core.MockGateway.doMethodCall(MockGateway.java:164)
[INFO] 	at org.powermock.core.MockGateway.methodCall(MockGateway.java:141)
[INFO] 	at org.apache.axiom.om.util.AXIOMUtil.stringToOM(AXIOMUtil.java)
[INFO] 	at org.wso2.carbon.apimgt.impl.workflow.ApplicationCreationWSWorkflowExecutor.execute_aroundBody2(ApplicationCreationWSWorkflowExecutor.java:97)
[INFO] 	at org.wso2.carbon.apimgt.impl.workflow.ApplicationCreationWSWorkflowExecutor.execute(ApplicationCreationWSWorkflowExecutor.java:61)
[INFO] 	at org.wso2.carbon.apimgt.impl.workflow.ApplicationCreationWSWorkflowExecutorTest.testWorkflowExecuteFailWhenMessageProcessingFailed(ApplicationCreationWSWorkflowExecutorTest.java:363)
[INFO] 	at sun.reflect.NativeMethodAccessorImpl.invoke0(Native Method)
[INFO] 	at sun.reflect.NativeMethodAccessorImpl.invoke(NativeMethodAccessorImpl.java:62)
[INFO] 	at sun.reflect.DelegatingMethodAccessorImpl.invoke(DelegatingMethodAccessorImpl.java:43)
[INFO] 	at java.lang.reflect.Method.invoke(Method.java:498)
[INFO] 	at org.junit.internal.runners.TestMethod.invoke(TestMethod.java:68)
[INFO] 	at org.powermock.modules.junit4.internal.impl.PowerMockJUnit44RunnerDelegateImpl$PowerMockJUnit44MethodRunner.runTestMethod(PowerMockJUnit44RunnerDelegateImpl.java:326)
[INFO] 	at org.junit.internal.runners.MethodRoadie$2.run(MethodRoadie.java:89)
[INFO] 	at org.junit.internal.runners.MethodRoadie.runBeforesThenTestThenAfters(MethodRoadie.java:97)
[INFO] 	at org.powermock.modules.junit4.internal.impl.PowerMockJUnit44RunnerDelegateImpl$PowerMockJUnit44MethodRunner.executeTest(PowerMockJUnit44RunnerDelegateImpl.java:310)
[INFO] 	at org.powermock.modules.junit4.internal.impl.PowerMockJUnit47RunnerDelegateImpl$PowerMockJUnit47MethodRunner.executeTestInSuper(PowerMockJUnit47RunnerDelegateImpl.java:131)
[INFO] 	at org.powermock.modules.junit4.internal.impl.PowerMockJUnit47RunnerDelegateImpl$PowerMockJUnit47MethodRunner.access$100(PowerMockJUnit47RunnerDelegateImpl.java:59)
[INFO] 	at org.powermock.modules.junit4.internal.impl.PowerMockJUnit47RunnerDelegateImpl$PowerMockJUnit47MethodRunner$TestExecutorStatement.evaluate(PowerMockJUnit47RunnerDelegateImpl.java:147)
[INFO] 	at org.powermock.modules.junit4.internal.impl.PowerMockJUnit47RunnerDelegateImpl$PowerMockJUnit47MethodRunner.evaluateStatement(PowerMockJUnit47RunnerDelegateImpl.java:107)
[INFO] 	at org.powermock.modules.junit4.internal.impl.PowerMockJUnit47RunnerDelegateImpl$PowerMockJUnit47MethodRunner.executeTest(PowerMockJUnit47RunnerDelegateImpl.java:82)
[INFO] 	at org.powermock.modules.junit4.internal.impl.PowerMockJUnit44RunnerDelegateImpl$PowerMockJUnit44MethodRunner.runBeforesThenTestThenAfters(PowerMockJUnit44RunnerDelegateImpl.java:298)
[INFO] 	at org.junit.internal.runners.MethodRoadie.runTest(MethodRoadie.java:87)
[INFO] 	at org.junit.internal.runners.MethodRoadie.run(MethodRoadie.java:50)
[INFO] 	at org.powermock.modules.junit4.internal.impl.PowerMockJUnit44RunnerDelegateImpl.invokeTestMethod(PowerMockJUnit44RunnerDelegateImpl.java:218)
[INFO] 	at org.powermock.modules.junit4.internal.impl.PowerMockJUnit44RunnerDelegateImpl.runMethods(PowerMockJUnit44RunnerDelegateImpl.java:160)
[INFO] 	at org.powermock.modules.junit4.internal.impl.PowerMockJUnit44RunnerDelegateImpl$1.run(PowerMockJUnit44RunnerDelegateImpl.java:134)
[INFO] 	at org.junit.internal.runners.ClassRoadie.runUnprotected(ClassRoadie.java:34)
[INFO] 	at org.junit.internal.runners.ClassRoadie.runProtected(ClassRoadie.java:44)
[INFO] 	at org.powermock.modules.junit4.internal.impl.PowerMockJUnit44RunnerDelegateImpl.run(PowerMockJUnit44RunnerDelegateImpl.java:136)
[INFO] 	at org.powermock.modules.junit4.common.internal.impl.JUnit4TestSuiteChunkerImpl.run(JUnit4TestSuiteChunkerImpl.java:121)
[INFO] 	at org.powermock.modules.junit4.common.internal.impl.AbstractCommonPowerMockRunner.run(AbstractCommonPowerMockRunner.java:57)
[INFO] 	at org.powermock.modules.junit4.PowerMockRunner.run(PowerMockRunner.java:59)
[INFO] 	at org.junit.runners.Suite.runChild(Suite.java:128)
[INFO] 	at org.junit.runners.Suite.runChild(Suite.java:27)
[INFO] 	at org.junit.runners.ParentRunner$3.run(ParentRunner.java:290)
[INFO] 	at org.junit.runners.ParentRunner$1.schedule(ParentRunner.java:71)
[INFO] 	at org.junit.runners.ParentRunner.runChildren(ParentRunner.java:288)
[INFO] 	at org.junit.runners.ParentRunner.access$000(ParentRunner.java:58)
[INFO] 	at org.junit.runners.ParentRunner$2.evaluate(ParentRunner.java:268)
[INFO] 	at org.junit.runners.ParentRunner.run(ParentRunner.java:363)
[INFO] 	at org.junit.runner.JUnitCore.run(JUnitCore.java:137)
[INFO] 	at org.junit.runner.JUnitCore.run(JUnitCore.java:115)
[INFO] 	at org.apache.maven.surefire.junitcore.JUnitCoreWrapper.createRequestAndRun(JUnitCoreWrapper.java:108)
[INFO] 	at org.apache.maven.surefire.junitcore.JUnitCoreWrapper.executeEager(JUnitCoreWrapper.java:78)
[INFO] 	at org.apache.maven.surefire.junitcore.JUnitCoreWrapper.execute(JUnitCoreWrapper.java:54)
[INFO] 	at org.apache.maven.surefire.junitcore.JUnitCoreProvider.invoke(JUnitCoreProvider.java:144)
[INFO] 	at org.apache.maven.surefire.booter.ForkedBooter.invokeProviderInSameClassLoader(ForkedBooter.java:203)
[INFO] 	at org.apache.maven.surefire.booter.ForkedBooter.runSuitesInProcess(ForkedBooter.java:155)
[INFO] 	at org.apache.maven.surefire.booter.ForkedBooter.main(ForkedBooter.java:103)
[INFO] [main] WARN org.apache.axiom.util.stax.dialect.StAXDialectDetector - Unable to determine dialect of the StAX implementation at jar:<https://wso2.org/jenkins/job/platform-builds/job/carbon-apimgt/org.wso2.carbon.apimgt$carbon-apimgt/ws/.repository/org/apache/ws/commons/axiom/wso2/axiom/1.2.11-wso2v16/axiom-1.2.11-wso2v16.jar!/>
[INFO] [main] INFO org.wso2.carbon.apimgt.impl.workflow.ApplicationCreationWSWorkflowExecutor - Application Creation [Complete] Workflow Invoked. Workflow ID : 89e542cd-3183-45f3-acac-315e1dd9fb9dWorkflow State : APPROVED
[INFO] [main] INFO org.wso2.carbon.apimgt.impl.workflow.ApplicationCreationWSWorkflowExecutor - Application Creation [Complete] Workflow Invoked. Workflow ID : a9d98fa6-942d-4d18-9c26-e4129558d139Workflow State : REJECTED
[INFO] [main] INFO org.wso2.carbon.apimgt.impl.workflow.ApplicationCreationWSWorkflowExecutor - Application Creation [Complete] Workflow Invoked. Workflow ID : 32927dfd-70e6-40b8-a6a5-5ebd5f3f9e04Workflow State : REGISTERED
[INFO] [main] ERROR org.wso2.carbon.apimgt.impl.workflow.ApplicationCreationWSWorkflowExecutor - Error sending out message
[INFO] org.apache.axis2.deployment.DeploymentException: org/codehaus/jettison/mapped/TypeConverter
[INFO] 	at org.apache.axis2.deployment.AxisConfigBuilder.processMessageFormatters(AxisConfigBuilder.java:761)
[INFO] 	at org.apache.axis2.deployment.AxisConfigBuilder.populateConfig(AxisConfigBuilder.java:268)
[INFO] 	at org.apache.axis2.deployment.DeploymentEngine.populateAxisConfiguration(DeploymentEngine.java:887)
[INFO] 	at org.apache.axis2.deployment.FileSystemConfigurator.getAxisConfiguration(FileSystemConfigurator.java:116)
[INFO] 	at org.apache.axis2.context.ConfigurationContextFactory.createConfigurationContext(ConfigurationContextFactory.java:64)
[INFO] 	at org.apache.axis2.context.ConfigurationContextFactory.createConfigurationContextFromFileSystem(ConfigurationContextFactory.java:210)
[INFO] 	at org.apache.axis2.client.ServiceClient.configureServiceClient(ServiceClient.java:151)
[INFO] 	at org.apache.axis2.client.ServiceClient.<init>(ServiceClient.java:143)
[INFO] 	at org.wso2.carbon.apimgt.impl.workflow.ApplicationCreationWSWorkflowExecutor.getClient_aroundBody10(ApplicationCreationWSWorkflowExecutor.java:197)
[INFO] 	at org.wso2.carbon.apimgt.impl.workflow.ApplicationCreationWSWorkflowExecutor.getClient(ApplicationCreationWSWorkflowExecutor.java:196)
[INFO] 	at org.wso2.carbon.apimgt.impl.workflow.ApplicationCreationWSWorkflowExecutor.execute_aroundBody2(ApplicationCreationWSWorkflowExecutor.java:68)
[INFO] 	at org.wso2.carbon.apimgt.impl.workflow.ApplicationCreationWSWorkflowExecutor.execute(ApplicationCreationWSWorkflowExecutor.java:61)
[INFO] 	at org.wso2.carbon.apimgt.impl.workflow.ApplicationCreationWSWorkflowExecutorTest.testWorkflowExecuteException(ApplicationCreationWSWorkflowExecutorTest.java:425)
[INFO] 	at sun.reflect.NativeMethodAccessorImpl.invoke0(Native Method)
[INFO] 	at sun.reflect.NativeMethodAccessorImpl.invoke(NativeMethodAccessorImpl.java:62)
[INFO] 	at sun.reflect.DelegatingMethodAccessorImpl.invoke(DelegatingMethodAccessorImpl.java:43)
[INFO] 	at java.lang.reflect.Method.invoke(Method.java:498)
[INFO] 	at org.junit.internal.runners.TestMethod.invoke(TestMethod.java:68)
[INFO] 	at org.powermock.modules.junit4.internal.impl.PowerMockJUnit44RunnerDelegateImpl$PowerMockJUnit44MethodRunner.runTestMethod(PowerMockJUnit44RunnerDelegateImpl.java:326)
[INFO] 	at org.junit.internal.runners.MethodRoadie$2.run(MethodRoadie.java:89)
[INFO] 	at org.junit.internal.runners.MethodRoadie.runBeforesThenTestThenAfters(MethodRoadie.java:97)
[INFO] 	at org.powermock.modules.junit4.internal.impl.PowerMockJUnit44RunnerDelegateImpl$PowerMockJUnit44MethodRunner.executeTest(PowerMockJUnit44RunnerDelegateImpl.java:310)
[INFO] 	at org.powermock.modules.junit4.internal.impl.PowerMockJUnit47RunnerDelegateImpl$PowerMockJUnit47MethodRunner.executeTestInSuper(PowerMockJUnit47RunnerDelegateImpl.java:131)
[INFO] 	at org.powermock.modules.junit4.internal.impl.PowerMockJUnit47RunnerDelegateImpl$PowerMockJUnit47MethodRunner.access$100(PowerMockJUnit47RunnerDelegateImpl.java:59)
[INFO] 	at org.powermock.modules.junit4.internal.impl.PowerMockJUnit47RunnerDelegateImpl$PowerMockJUnit47MethodRunner$TestExecutorStatement.evaluate(PowerMockJUnit47RunnerDelegateImpl.java:147)
[INFO] 	at org.powermock.modules.junit4.internal.impl.PowerMockJUnit47RunnerDelegateImpl$PowerMockJUnit47MethodRunner.evaluateStatement(PowerMockJUnit47RunnerDelegateImpl.java:107)
[INFO] 	at org.powermock.modules.junit4.internal.impl.PowerMockJUnit47RunnerDelegateImpl$PowerMockJUnit47MethodRunner.executeTest(PowerMockJUnit47RunnerDelegateImpl.java:82)
[INFO] 	at org.powermock.modules.junit4.internal.impl.PowerMockJUnit44RunnerDelegateImpl$PowerMockJUnit44MethodRunner.runBeforesThenTestThenAfters(PowerMockJUnit44RunnerDelegateImpl.java:298)
[INFO] 	at org.junit.internal.runners.MethodRoadie.runTest(MethodRoadie.java:87)
[INFO] 	at org.junit.internal.runners.MethodRoadie.run(MethodRoadie.java:50)
[INFO] 	at org.powermock.modules.junit4.internal.impl.PowerMockJUnit44RunnerDelegateImpl.invokeTestMethod(PowerMockJUnit44RunnerDelegateImpl.java:218)
[INFO] 	at org.powermock.modules.junit4.internal.impl.PowerMockJUnit44RunnerDelegateImpl.runMethods(PowerMockJUnit44RunnerDelegateImpl.java:160)
[INFO] 	at org.powermock.modules.junit4.internal.impl.PowerMockJUnit44RunnerDelegateImpl$1.run(PowerMockJUnit44RunnerDelegateImpl.java:134)
[INFO] 	at org.junit.internal.runners.ClassRoadie.runUnprotected(ClassRoadie.java:34)
[INFO] 	at org.junit.internal.runners.ClassRoadie.runProtected(ClassRoadie.java:44)
[INFO] 	at org.powermock.modules.junit4.internal.impl.PowerMockJUnit44RunnerDelegateImpl.run(PowerMockJUnit44RunnerDelegateImpl.java:136)
[INFO] 	at org.powermock.modules.junit4.common.internal.impl.JUnit4TestSuiteChunkerImpl.run(JUnit4TestSuiteChunkerImpl.java:121)
[INFO] 	at org.powermock.modules.junit4.common.internal.impl.AbstractCommonPowerMockRunner.run(AbstractCommonPowerMockRunner.java:57)
[INFO] 	at org.powermock.modules.junit4.PowerMockRunner.run(PowerMockRunner.java:59)
[INFO] 	at org.junit.runners.Suite.runChild(Suite.java:128)
[INFO] 	at org.junit.runners.Suite.runChild(Suite.java:27)
[INFO] 	at org.junit.runners.ParentRunner$3.run(ParentRunner.java:290)
[INFO] 	at org.junit.runners.ParentRunner$1.schedule(ParentRunner.java:71)
[INFO] 	at org.junit.runners.ParentRunner.runChildren(ParentRunner.java:288)
[INFO] 	at org.junit.runners.ParentRunner.access$000(ParentRunner.java:58)
[INFO] 	at org.junit.runners.ParentRunner$2.evaluate(ParentRunner.java:268)
[INFO] 	at org.junit.runners.ParentRunner.run(ParentRunner.java:363)
[INFO] 	at org.junit.runner.JUnitCore.run(JUnitCore.java:137)
[INFO] 	at org.junit.runner.JUnitCore.run(JUnitCore.java:115)
[INFO] 	at org.apache.maven.surefire.junitcore.JUnitCoreWrapper.createRequestAndRun(JUnitCoreWrapper.java:108)
[INFO] 	at org.apache.maven.surefire.junitcore.JUnitCoreWrapper.executeEager(JUnitCoreWrapper.java:78)
[INFO] 	at org.apache.maven.surefire.junitcore.JUnitCoreWrapper.execute(JUnitCoreWrapper.java:54)
[INFO] 	at org.apache.maven.surefire.junitcore.JUnitCoreProvider.invoke(JUnitCoreProvider.java:144)
[INFO] 	at org.apache.maven.surefire.booter.ForkedBooter.invokeProviderInSameClassLoader(ForkedBooter.java:203)
[INFO] 	at org.apache.maven.surefire.booter.ForkedBooter.runSuitesInProcess(ForkedBooter.java:155)
[INFO] 	at org.apache.maven.surefire.booter.ForkedBooter.main(ForkedBooter.java:103)
[INFO] Caused by: java.lang.NoClassDefFoundError: org/codehaus/jettison/mapped/TypeConverter
[INFO] 	at java.lang.Class.getDeclaredConstructors0(Native Method)
[INFO] 	at java.lang.Class.privateGetDeclaredConstructors(Class.java:2671)
[INFO] 	at java.lang.Class.getConstructor0(Class.java:3075)
[INFO] 	at java.lang.Class.newInstance(Class.java:412)
[INFO] 	at org.apache.axis2.deployment.DescriptionBuilder.processMessageFormatters(DescriptionBuilder.java:269)
[INFO] 	at org.apache.axis2.deployment.AxisConfigBuilder.processMessageFormatters(AxisConfigBuilder.java:758)
[INFO] 	... 55 more
[INFO] Caused by: java.lang.ClassNotFoundException: org.codehaus.jettison.mapped.TypeConverter
[INFO] 	at java.net.URLClassLoader.findClass(URLClassLoader.java:381)
[INFO] 	at java.lang.ClassLoader.loadClass(ClassLoader.java:424)
[INFO] 	at sun.misc.Launcher$AppClassLoader.loadClass(Launcher.java:349)
[INFO] 	at java.lang.ClassLoader.loadClass(ClassLoader.java:357)
[INFO] 	at org.powermock.core.classloader.MockClassLoader.loadModifiedClass(MockClassLoader.java:202)
[INFO] 	at org.powermock.core.classloader.DeferSupportingClassLoader.loadClass1(DeferSupportingClassLoader.java:89)
[INFO] 	at org.powermock.core.classloader.DeferSupportingClassLoader.loadClass(DeferSupportingClassLoader.java:79)
[INFO] 	at java.lang.ClassLoader.loadClass(ClassLoader.java:357)
[INFO] 	... 61 more
[INFO] Tests run: 21, Failures: 0, Errors: 0, Skipped: 0, Time elapsed: 1.41 sec - in org.wso2.carbon.apimgt.impl.workflow.ApplicationCreationWSWorkflowExecutorTest
[INFO] 
[INFO] Results :
[INFO] 
[INFO] Tests in error: 
[INFO]   APIClientGenerationManagerTestCase.getSupportedSDKLanguagesTest:30 » NullPointer
[INFO] 
[INFO] Tests run: 922, Failures: 0, Errors: 1, Skipped: 0
[INFO] 
[INFO] [INFO] ------------------------------------------------------------------------
[INFO] [INFO] Reactor Summary:
[INFO] [INFO] 
[INFO] [INFO] WSO2 Carbon - API Management Aggregator POM ........ SUCCESS [  2.020 s]
[INFO] [INFO] API Management ..................................... SUCCESS [  0.014 s]
[INFO] [INFO] WSO2 Carbon - API Security Handler Service Stub .... SUCCESS [  6.816 s]
[INFO] [INFO] WSO2 Carbon - API Key Management Stub .............. SUCCESS [  7.796 s]
[INFO] [INFO] WSO2 Carbon - API Gateway Management Stub .......... SUCCESS [  4.248 s]
[INFO] [INFO] WSO2 Carbon - API Stat Publishing Status Update Service Stub SUCCESS [  1.745 s]
[INFO] [INFO] WSO2 Carbon - Tier Cache Service Stub .............. SUCCESS [  1.448 s]
[INFO] [INFO] WSO2 Carbon - Registry Cache Invalidation Service Stub SUCCESS [  1.547 s]
[INFO] [INFO] WSO2 Carbon - Locale Entry Stub .................... SUCCESS [  1.614 s]
[INFO] [INFO] OpenID Connect Authenticator stubs ................. SUCCESS [  0.013 s]
[INFO] [INFO] WSO2 Carbon - OpenID Connect Authenticator Stub .... SUCCESS [  4.462 s]
[INFO] [INFO] API Management ..................................... SUCCESS [  0.010 s]
[INFO] [INFO] WSO2 Carbon - Api for API Management ............... SUCCESS [  1.019 s]
[INFO] [INFO] WSO2 Carbon - API Key Mgt Client ................... SUCCESS [ 10.163 s]
[INFO] [INFO] WSO2 Carbon - API Management Implementation ........ FAILURE [04:03 min]
[INFO] [INFO] WSO2 Carbon - API Management Usage Aggregator Module SKIPPED
[INFO] [INFO] WSO2 Carbon - API Management Usage Client .......... SKIPPED
[INFO] [INFO] WSO2 Carbon - HostObject for API management ........ SKIPPED
[INFO] [INFO] WSO2 Carbon - API Tracing .......................... SKIPPED
[INFO] [INFO] WSO2 Carbon - API Key Mgt .......................... SKIPPED
[INFO] [INFO] WSO2 Carbon - API Management Usage Publisher ....... SKIPPED
[INFO] [INFO] WSO2 Carbon - API Gateway .......................... SKIPPED
[INFO] [INFO] WSO2 Carbon - API Management Core .................. SKIPPED
[INFO] [INFO] WSO2 Carbon - API Manager Rest API Utility ......... SKIPPED
[INFO] [INFO] WSO2 Carbon - API Manager Incerceptor for throttle data service SKIPPED
[INFO] [INFO] WSO2 API Manager Store REST API .................... SKIPPED
[INFO] [INFO] WSO2 API Manager Store REST API - v1 ............... SKIPPED
[INFO] [INFO] WSO2 API Manager Publisher REST API ................ SKIPPED
[INFO] [INFO] WSO2 API Manager Publisher REST API - v1 ........... SKIPPED
[INFO] [INFO] WSO2 API Manager Admin REST API .................... SKIPPED
[INFO] [INFO] WSO2 Carbon API Manager- Dynamic Client Registration Web Service SKIPPED
[INFO] [INFO] WSO2 API Manager Throttle Data Service ............. SKIPPED
[INFO] [INFO] WSO2 API Manager Throttling Siddhi Extension ....... SKIPPED
[INFO] [INFO] WSO2 Carbon - Sample API ........................... SKIPPED
[INFO] [INFO] WSO2 Carbon - Sample API ........................... SKIPPED
[INFO] [INFO] org.wso2.carbon.apimgt.jms.listener ................ SKIPPED
[INFO] [INFO] org.wso2.carbon.apimgt.broker.lifecycle ............ SKIPPED
[INFO] [INFO] WSO2 Carbon - API Manager Hybrid API Gateway ....... SKIPPED
[INFO] [INFO] WSO2 Carbon - Hybrid API Gateway Common ............ SKIPPED
[INFO] [INFO] WSO2 Carbon - Hybrid API Gateway Tenant Initialization SKIPPED
[INFO] [INFO] WSO2 Carbon - Hybrid API Gateway Throttling Synchronizer SKIPPED
[INFO] [INFO] WSO2 Carbon - Hybrid API Gateway Usage publisher ... SKIPPED
[INFO] [INFO] WSO2 Carbon - Hybrid API Gateway REST API .......... SKIPPED
[INFO] [INFO] WSO2 Carbon - Hybrid API Gateway API synchronization SKIPPED
[INFO] [INFO] WSO2 Carbon - Hybrid API Gateway Configurator ...... SKIPPED
[INFO] [INFO] WSO2 Carbon - Hybrid API Gateway Status Checker .... SKIPPED
[INFO] [INFO] Forum .............................................. SKIPPED
[INFO] [INFO] WSO2 Carbon - Forum Component ...................... SKIPPED
[INFO] [INFO] WSO2 Carbon - Hostobjects Aggregator Module ........ SKIPPED
[INFO] [INFO] WSO2 Carbon - Single Sign-On Relying party HostObject SKIPPED
[INFO] [INFO] WSO2 Carbon - OIDC Based SSO Authenticator Aggregator Module SKIPPED
[INFO] [INFO] OIDC SSO Authenticator - UI bundle ................. SKIPPED
[INFO] [INFO] OIDC Authenticator - BE bundle ..................... SKIPPED
[INFO] [INFO] WSO2 Carbon -OIDC HostObject ....................... SKIPPED
[INFO] [INFO] WSO2 Carbon - API management Feature Aggregator Module SKIPPED
[INFO] [INFO] WSO2 Carbon - Api management Core Feature .......... SKIPPED
[INFO] [INFO] WSO2 Carbon - Api management Gateway Feature ....... SKIPPED
[INFO] [INFO] WSO2 Carbon - Api Management JMS Listener Feature .. SKIPPED
[INFO] [INFO] WSO2 Carbon - API Publisher Feature ................ SKIPPED
[INFO] [INFO] WSO2 Carbon - API Developer Portal Feature ......... SKIPPED
[INFO] [INFO] WSO2 Carbon - Api management Key Manager Feature ... SKIPPED
[INFO] [INFO] WSO2 Carbon - Api management Feature ............... SKIPPED
[INFO] [INFO] WSO2 Carbon - API Publisher Rest API Feature ....... SKIPPED
[INFO] [INFO] WSO2 Carbon - API Store Rest API Feature ........... SKIPPED
[INFO] [INFO] WSO2 Carbon - API Manager Admin Rest API Feature ... SKIPPED
[INFO] [INFO] WSO2 Carbon - API Dynamic Client Registration Rest API Feature SKIPPED
[INFO] [INFO] WSO2 Carbon - SCXML Feature ........................ SKIPPED
[INFO] [INFO] WSO2 Carbon - Event Throtting Siddhi Extension ..... SKIPPED
[INFO] [INFO] WSO2 Carbon - Api management Tracing Feature ....... SKIPPED
[INFO] [INFO] WSO2 Carbon - Forum Feature Aggregator Module ...... SKIPPED
[INFO] [INFO] WSO2 Carbon - Forum Server Feature ................. SKIPPED
[INFO] [INFO] WSO2 Carbon - Forum Feature ........................ SKIPPED
[INFO] [INFO] WSO2 Carbon - OIDC Authenticator Feature Aggregator Module SKIPPED
[INFO] [INFO] OIDC based authenticator UI Feature ................ SKIPPED
[INFO] [INFO] OIDC based authenticator Server Feature ............ SKIPPED
[INFO] [INFO] OIDC based Single Sign-On authenticator Feature .... SKIPPED
[INFO] [INFO] OIDC based authenticator - Hostobject .............. SKIPPED
[INFO] [INFO] WSO2 APIManager - Feature Categories ............... SKIPPED
[INFO] [INFO] API Gateway Manager 6.5.344 ........................ SKIPPED
[INFO] [INFO] API Gateway Worker 6.5.344 ......................... SKIPPED
[INFO] [INFO] API Key Manager 6.5.344 ............................ SKIPPED
[INFO] [INFO] API Publisher 6.5.344 .............................. SKIPPED
[INFO] [INFO] API Store 6.5.344 .................................. SKIPPED
[INFO] [INFO] ------------------------------------------------------------------------
[INFO] [INFO] BUILD FAILURE
[INFO] [INFO] ------------------------------------------------------------------------
[INFO] [INFO] Total time: 04:48 min
[INFO] [INFO] Finished at: 2019-10-24T11:50:58+00:00
[INFO] [INFO] Final Memory: 162M/696M
[INFO] [INFO] ------------------------------------------------------------------------
[INFO] [ERROR] Failed to execute goal org.apache.maven.plugins:maven-surefire-plugin:2.18.1:test (default-test) on project org.wso2.carbon.apimgt.impl: There are test failures.
[INFO] [ERROR] 
[INFO] [ERROR] Please refer to <https://wso2.org/jenkins/job/platform-builds/job/carbon-apimgt/org.wso2.carbon.apimgt$carbon-apimgt/ws/components/apimgt/org.wso2.carbon.apimgt.impl/target/surefire-reports> for the individual test results.
[INFO] [ERROR] -> [Help 1]
[INFO] [ERROR] 
[INFO] [ERROR] To see the full stack trace of the errors, re-run Maven with the -e switch.
[INFO] [ERROR] Re-run Maven using the -X switch to enable full debug logging.
[INFO] [ERROR] 
[INFO] [ERROR] For more information about the errors and possible solutions, please read the following articles:
[INFO] [ERROR] [Help 1] http://cwiki.apache.org/confluence/display/MAVEN/MojoFailureException
[INFO] [ERROR] 
[INFO] [ERROR] After correcting the problems, you can resume the build with the command
[INFO] [ERROR]   mvn <goals> -rf :org.wso2.carbon.apimgt.impl


More information about the Builder mailing list