[Builder] Build failed in Jenkins: forked-dependencies » wso2-synapse #4569

cbuilder at wso2.org cbuilder at wso2.org
Thu Feb 13 01:34:31 PST 2020


See <https://wso2.org/jenkins/job/forked-dependencies/job/wso2-synapse/4569/display/redirect>

Changes:


------------------------------------------
[...truncated 1.52 MB...]
[INFO] Generating <https://wso2.org/jenkins/job/forked-dependencies/job/wso2-synapse/ws/modules/core/target/apidocs/overview-summary.html...>
[INFO] Generating <https://wso2.org/jenkins/job/forked-dependencies/job/wso2-synapse/ws/modules/core/target/apidocs/help-doc.html...>
[INFO] 43 warnings
[INFO] [WARNING] Javadoc Warnings
[INFO] [WARNING] <https://wso2.org/jenkins/job/forked-dependencies/job/wso2-synapse/ws/modules/core/src/main/java/org/apache/synapse/SynapseLog.java>:49: warning - Tag @link: can't find debug(Object) in org.apache.synapse.SynapseLog
[INFO] [WARNING] <https://wso2.org/jenkins/job/forked-dependencies/job/wso2-synapse/ws/modules/core/src/main/java/org/apache/synapse/SynapseLog.java>:57: warning - Tag @link: can't find trace(Object) in org.apache.synapse.SynapseLog
[INFO] [WARNING] <https://wso2.org/jenkins/job/forked-dependencies/job/wso2-synapse/ws/modules/core/src/main/java/org/apache/synapse/eventing/builders/ResponseMessageBuilder.java>:87: warning - @return tag has no arguments.
[INFO] [WARNING] <https://wso2.org/jenkins/job/forked-dependencies/job/wso2-synapse/ws/modules/core/src/main/java/org/apache/synapse/eventing/builders/ResponseMessageBuilder.java>:133: warning - @return tag has no arguments.
[INFO] [WARNING] <https://wso2.org/jenkins/job/forked-dependencies/job/wso2-synapse/ws/modules/core/src/main/java/org/apache/synapse/eventing/builders/ResponseMessageBuilder.java>:167: warning - @return tag has no arguments.
[INFO] [WARNING] <https://wso2.org/jenkins/job/forked-dependencies/job/wso2-synapse/ws/modules/core/src/main/java/org/apache/synapse/eventing/builders/ResponseMessageBuilder.java>:207: warning - @return tag has no arguments.
[INFO] [WARNING] <https://wso2.org/jenkins/job/forked-dependencies/job/wso2-synapse/ws/modules/core/src/main/java/org/apache/synapse/eventing/builders/ResponseMessageBuilder.java>:258: warning - @return tag has no arguments.
[INFO] [WARNING] <https://wso2.org/jenkins/job/forked-dependencies/job/wso2-synapse/ws/modules/core/src/main/java/org/apache/synapse/config/SynapseConfiguration.java>:1974: warning - @return tag has no arguments.
[INFO] [WARNING] <https://wso2.org/jenkins/job/forked-dependencies/job/wso2-synapse/ws/modules/core/src/main/java/org/apache/synapse/mediators/AbstractMediator.java>:470: warning - @return tag has no arguments.
[INFO] [WARNING] <https://wso2.org/jenkins/job/forked-dependencies/job/wso2-synapse/ws/modules/core/src/main/java/org/apache/synapse/config/xml/ConfigurationFactoryAndSerializerFinder.java>:178: warning - @return tag has no arguments.
[INFO] [WARNING] <https://wso2.org/jenkins/job/forked-dependencies/job/wso2-synapse/ws/modules/core/src/main/java/org/apache/synapse/config/xml/endpoints/EndpointFactory.java>:309: warning - @return tag has no arguments.
[INFO] [WARNING] <https://wso2.org/jenkins/job/forked-dependencies/job/wso2-synapse/ws/modules/core/src/main/java/org/apache/synapse/mediators/transform/PayloadFactoryMediator.java>:108: warning - @return tag has no arguments.
[INFO] [WARNING] <https://wso2.org/jenkins/job/forked-dependencies/job/wso2-synapse/ws/modules/core/src/main/java/org/apache/synapse/libraries/model/Library.java>:60: warning - @return tag has no arguments.
[INFO] [WARNING] <https://wso2.org/jenkins/job/forked-dependencies/job/wso2-synapse/ws/modules/core/src/main/java/org/apache/synapse/libraries/model/Library.java>:71: warning - @return tag has no arguments.
[INFO] [WARNING] <https://wso2.org/jenkins/job/forked-dependencies/job/wso2-synapse/ws/modules/core/src/main/java/org/apache/synapse/libraries/model/Library.java>:107: warning - @return tag has no arguments.
[INFO] [WARNING] <https://wso2.org/jenkins/job/forked-dependencies/job/wso2-synapse/ws/modules/core/src/main/java/org/apache/synapse/libraries/model/Library.java>:117: warning - @return tag has no arguments.
[INFO] [WARNING] <https://wso2.org/jenkins/job/forked-dependencies/job/wso2-synapse/ws/modules/core/src/main/java/org/apache/synapse/libraries/model/Library.java>:123: warning - @return tag has no arguments.
[INFO] [WARNING] <https://wso2.org/jenkins/job/forked-dependencies/job/wso2-synapse/ws/modules/core/src/main/java/org/apache/synapse/libraries/model/Library.java>:123: warning - @return tag cannot be used in method with void return type.
[INFO] [WARNING] <https://wso2.org/jenkins/job/forked-dependencies/job/wso2-synapse/ws/modules/core/src/main/java/org/apache/synapse/libraries/model/SynapseLibrary.java>:189: warning - @return tag has no arguments.
[INFO] [WARNING] <https://wso2.org/jenkins/job/forked-dependencies/job/wso2-synapse/ws/modules/core/src/main/java/org/apache/synapse/libraries/model/SynapseLibrary.java>:142: warning - @return tag cannot be used in method with void return type.
[INFO] [WARNING] <https://wso2.org/jenkins/job/forked-dependencies/job/wso2-synapse/ws/modules/core/src/main/java/org/apache/synapse/rest/cors/CORSHelper.java>:44: warning - @return tag has no arguments.
[INFO] [WARNING] <https://wso2.org/jenkins/job/forked-dependencies/job/wso2-synapse/ws/modules/core/src/main/java/org/apache/synapse/message/store/impl/jms/JmsStore.java>:388: warning - @return tag cannot be used in method with void return type.
[INFO] [WARNING] <https://wso2.org/jenkins/job/forked-dependencies/job/wso2-synapse/ws/modules/core/src/main/java/org/apache/synapse/message/store/impl/jms/JmsStore.java>:404: warning - @return tag cannot be used in method with void return type.
[INFO] [WARNING] <https://wso2.org/jenkins/job/forked-dependencies/job/wso2-synapse/ws/modules/core/src/main/java/org/apache/synapse/message/store/impl/jms/JmsStore.java>:428: warning - @return tag cannot be used in method with void return type.
[INFO] [WARNING] <https://wso2.org/jenkins/job/forked-dependencies/job/wso2-synapse/ws/modules/core/src/main/java/org/apache/synapse/message/store/impl/commons/StorableMessage.java>:62: warning - @return tag has no arguments.
[INFO] [WARNING] <https://wso2.org/jenkins/job/forked-dependencies/job/wso2-synapse/ws/modules/core/src/main/java/org/apache/synapse/message/store/impl/commons/StorableMessage.java>:62: warning - @Depricated is an unknown tag.
[INFO] [WARNING] <https://wso2.org/jenkins/job/forked-dependencies/job/wso2-synapse/ws/modules/core/src/main/java/org/apache/synapse/message/processor/impl/failover/FailoverMessageForwardingProcessorViewMBean.java>:48: warning - @return tag cannot be used in method with void return type.
[INFO] [WARNING] <https://wso2.org/jenkins/job/forked-dependencies/job/wso2-synapse/ws/modules/core/src/main/java/org/apache/synapse/message/processor/impl/sampler/SamplingProcessorViewMBean.java>:39: warning - @return tag has no arguments.
[INFO] [WARNING] <https://wso2.org/jenkins/job/forked-dependencies/job/wso2-synapse/ws/modules/core/src/main/java/org/apache/synapse/message/processor/impl/forwarder/MessageForwardingProcessorViewMBean.java>:48: warning - @return tag cannot be used in method with void return type.
[INFO] [WARNING] <https://wso2.org/jenkins/job/forked-dependencies/job/wso2-synapse/ws/modules/core/src/main/java/org/apache/synapse/core/SynapseEnvironment.java>:175: warning - @return tag has no arguments.
[INFO] [WARNING] <https://wso2.org/jenkins/job/forked-dependencies/job/wso2-synapse/ws/modules/core/src/main/java/org/apache/synapse/debug/SynapseDebugManager.java>:698: warning - @return tag has no arguments.
[INFO] [WARNING] <https://wso2.org/jenkins/job/forked-dependencies/job/wso2-synapse/ws/modules/core/src/main/java/org/apache/synapse/endpoints/dispatch/SALSessions.java>:224: warning - @param argument "sessionID" is not a parameter name.
[INFO] [WARNING] <https://wso2.org/jenkins/job/forked-dependencies/job/wso2-synapse/ws/modules/core/src/main/java/org/apache/synapse/endpoints/AbstractEndpoint.java>:249: warning - @return tag has no arguments.
[INFO] [WARNING] <https://wso2.org/jenkins/job/forked-dependencies/job/wso2-synapse/ws/modules/core/src/main/java/org/apache/synapse/endpoints/Endpoint.java>:144: warning - @return tag has no arguments.
[INFO] [WARNING] <https://wso2.org/jenkins/job/forked-dependencies/job/wso2-synapse/ws/modules/core/src/main/java/org/apache/synapse/endpoints/LoadbalanceEndpoint.java>:149: warning - @return tag has no arguments.
[INFO] [WARNING] <https://wso2.org/jenkins/job/forked-dependencies/job/wso2-synapse/ws/modules/core/src/main/java/org/apache/synapse/endpoints/Endpoint.java>:127: warning - @param argument "onFaultMessageStore," is not a parameter name.
[INFO] [WARNING] <https://wso2.org/jenkins/job/forked-dependencies/job/wso2-synapse/ws/modules/core/src/main/java/org/apache/synapse/util/jaxp/ResultBuilder.java>:43: warning - Tag @link: can't find getNode() in org.apache.synapse.util.jaxp.ResultBuilder
[INFO] [WARNING] <https://wso2.org/jenkins/job/forked-dependencies/job/wso2-synapse/ws/modules/core/src/main/java/org/apache/synapse/util/jaxp/ResultBuilderFactory.java>:48: warning - Tag @link: can't find getNode() in org.apache.synapse.util.jaxp.ResultBuilder
[INFO] [WARNING] <https://wso2.org/jenkins/job/forked-dependencies/job/wso2-synapse/ws/modules/core/src/main/java/org/apache/synapse/util/jaxp/SchemaResourceLSInput.java>:25: warning - Tag @link: reference not found: org.apache.xerces.util.DOMEntityResolverWrapper
[INFO] [WARNING] <https://wso2.org/jenkins/job/forked-dependencies/job/wso2-synapse/ws/modules/core/src/main/java/org/apache/synapse/carbonext/TenantInfoConfigurator.java>:29: warning - @return tag has no arguments.
[INFO] [WARNING] <https://wso2.org/jenkins/job/forked-dependencies/job/wso2-synapse/ws/modules/core/src/main/java/org/apache/synapse/carbonext/TenantInfoConfigurator.java>:36: warning - @return tag has no arguments.
[INFO] [WARNING] <https://wso2.org/jenkins/job/forked-dependencies/job/wso2-synapse/ws/modules/core/src/main/java/org/apache/synapse/util/jaxp/SchemaResourceLSInput.java>:25: warning - Tag @link: reference not found: org.apache.xerces.util.DOMEntityResolverWrapper
[INFO] [WARNING] <https://wso2.org/jenkins/job/forked-dependencies/job/wso2-synapse/ws/modules/core/src/main/java/org/apache/synapse/util/jaxp/SchemaResourceLSInput.java>:25: warning - Tag @link: reference not found: org.apache.xerces.util.DOMEntityResolverWrapper
[INFO] [INFO] Building jar: <https://wso2.org/jenkins/job/forked-dependencies/job/wso2-synapse/ws/modules/core/target/synapse-core-2.1.7-wso2v145-SNAPSHOT-javadoc.jar>
[INFO] [INFO] 
[INFO] [INFO] --- maven-jar-plugin:2.1:test-jar (default) @ synapse-core ---
[INFO] [INFO] Downloading from wso2.releases: http://maven.wso2.org/nexus/content/repositories/releases/commons-lang/commons-lang/2.1/commons-lang-2.1.jar
[INFO] [INFO] Downloading from wso2-nexus: http://maven.wso2.org/nexus/content/groups/wso2-public/commons-lang/commons-lang/2.1/commons-lang-2.1.jar
[INFO] [INFO] Downloaded from wso2-nexus: http://maven.wso2.org/nexus/content/groups/wso2-public/commons-lang/commons-lang/2.1/commons-lang-2.1.jar (208 kB at 42 MB/s)
[INFO] [INFO] Building jar: <https://wso2.org/jenkins/job/forked-dependencies/job/wso2-synapse/ws/modules/core/target/synapse-core-2.1.7-wso2v145-SNAPSHOT-tests.jar>
[INFO] [INFO] 
[INFO] [INFO] --- maven-gpg-plugin:1.5:sign (default) @ synapse-core ---
[INFO] gpg: WARNING: unsafe ownership on homedir `/build/gpg-keys/.gnupg'
[INFO] gpg: WARNING: unsafe ownership on homedir `/build/gpg-keys/.gnupg'
[INFO] gpg: WARNING: unsafe ownership on homedir `/build/gpg-keys/.gnupg'
[INFO] gpg: WARNING: unsafe ownership on homedir `/build/gpg-keys/.gnupg'
[INFO] gpg: WARNING: unsafe ownership on homedir `/build/gpg-keys/.gnupg'
[INFO] gpg: WARNING: unsafe ownership on homedir `/build/gpg-keys/.gnupg'
[INFO] [INFO] 
[INFO] [INFO] --- maven-install-plugin:2.5.2:install (default-install) @ synapse-core ---
[INFO] [INFO] Installing <https://wso2.org/jenkins/job/forked-dependencies/job/wso2-synapse/ws/modules/core/target/synapse-core-2.1.7-wso2v145-SNAPSHOT.jar> to <https://wso2.org/jenkins/job/forked-dependencies/job/wso2-synapse/ws/.repository/org/apache/synapse/synapse-core/2.1.7-wso2v145-SNAPSHOT/synapse-core-2.1.7-wso2v145-SNAPSHOT.jar>
[INFO] [INFO] Installing <https://wso2.org/jenkins/job/forked-dependencies/job/wso2-synapse/ws/modules/core/pom.xml> to <https://wso2.org/jenkins/job/forked-dependencies/job/wso2-synapse/ws/.repository/org/apache/synapse/synapse-core/2.1.7-wso2v145-SNAPSHOT/synapse-core-2.1.7-wso2v145-SNAPSHOT.pom>
[INFO] [INFO] Installing <https://wso2.org/jenkins/job/forked-dependencies/job/wso2-synapse/ws/modules/core/target/synapse-core-2.1.7-wso2v145-SNAPSHOT-source-release.zip> to <https://wso2.org/jenkins/job/forked-dependencies/job/wso2-synapse/ws/.repository/org/apache/synapse/synapse-core/2.1.7-wso2v145-SNAPSHOT/synapse-core-2.1.7-wso2v145-SNAPSHOT-source-release.zip>
[INFO] [INFO] Installing <https://wso2.org/jenkins/job/forked-dependencies/job/wso2-synapse/ws/modules/core/target/synapse-core-2.1.7-wso2v145-SNAPSHOT-sources.jar> to <https://wso2.org/jenkins/job/forked-dependencies/job/wso2-synapse/ws/.repository/org/apache/synapse/synapse-core/2.1.7-wso2v145-SNAPSHOT/synapse-core-2.1.7-wso2v145-SNAPSHOT-sources.jar>
[INFO] [INFO] Installing <https://wso2.org/jenkins/job/forked-dependencies/job/wso2-synapse/ws/modules/core/target/synapse-core-2.1.7-wso2v145-SNAPSHOT-javadoc.jar> to <https://wso2.org/jenkins/job/forked-dependencies/job/wso2-synapse/ws/.repository/org/apache/synapse/synapse-core/2.1.7-wso2v145-SNAPSHOT/synapse-core-2.1.7-wso2v145-SNAPSHOT-javadoc.jar>
[INFO] [INFO] Installing <https://wso2.org/jenkins/job/forked-dependencies/job/wso2-synapse/ws/modules/core/target/synapse-core-2.1.7-wso2v145-SNAPSHOT-tests.jar> to <https://wso2.org/jenkins/job/forked-dependencies/job/wso2-synapse/ws/.repository/org/apache/synapse/synapse-core/2.1.7-wso2v145-SNAPSHOT/synapse-core-2.1.7-wso2v145-SNAPSHOT-tests.jar>
[INFO] [INFO] Installing <https://wso2.org/jenkins/job/forked-dependencies/job/wso2-synapse/ws/modules/core/target/synapse-core-2.1.7-wso2v145-SNAPSHOT.jar.asc> to <https://wso2.org/jenkins/job/forked-dependencies/job/wso2-synapse/ws/.repository/org/apache/synapse/synapse-core/2.1.7-wso2v145-SNAPSHOT/synapse-core-2.1.7-wso2v145-SNAPSHOT.jar.asc>
[INFO] [INFO] Installing <https://wso2.org/jenkins/job/forked-dependencies/job/wso2-synapse/ws/modules/core/target/synapse-core-2.1.7-wso2v145-SNAPSHOT.pom.asc> to <https://wso2.org/jenkins/job/forked-dependencies/job/wso2-synapse/ws/.repository/org/apache/synapse/synapse-core/2.1.7-wso2v145-SNAPSHOT/synapse-core-2.1.7-wso2v145-SNAPSHOT.pom.asc>
[INFO] [INFO] Installing <https://wso2.org/jenkins/job/forked-dependencies/job/wso2-synapse/ws/modules/core/target/synapse-core-2.1.7-wso2v145-SNAPSHOT-source-release.zip.asc> to <https://wso2.org/jenkins/job/forked-dependencies/job/wso2-synapse/ws/.repository/org/apache/synapse/synapse-core/2.1.7-wso2v145-SNAPSHOT/synapse-core-2.1.7-wso2v145-SNAPSHOT-source-release.zip.asc>
[INFO] [INFO] Installing <https://wso2.org/jenkins/job/forked-dependencies/job/wso2-synapse/ws/modules/core/target/synapse-core-2.1.7-wso2v145-SNAPSHOT-sources.jar.asc> to <https://wso2.org/jenkins/job/forked-dependencies/job/wso2-synapse/ws/.repository/org/apache/synapse/synapse-core/2.1.7-wso2v145-SNAPSHOT/synapse-core-2.1.7-wso2v145-SNAPSHOT-sources.jar.asc>
[INFO] [INFO] Installing <https://wso2.org/jenkins/job/forked-dependencies/job/wso2-synapse/ws/modules/core/target/synapse-core-2.1.7-wso2v145-SNAPSHOT-javadoc.jar.asc> to <https://wso2.org/jenkins/job/forked-dependencies/job/wso2-synapse/ws/.repository/org/apache/synapse/synapse-core/2.1.7-wso2v145-SNAPSHOT/synapse-core-2.1.7-wso2v145-SNAPSHOT-javadoc.jar.asc>
[INFO] [INFO] Installing <https://wso2.org/jenkins/job/forked-dependencies/job/wso2-synapse/ws/modules/core/target/synapse-core-2.1.7-wso2v145-SNAPSHOT-tests.jar.asc> to <https://wso2.org/jenkins/job/forked-dependencies/job/wso2-synapse/ws/.repository/org/apache/synapse/synapse-core/2.1.7-wso2v145-SNAPSHOT/synapse-core-2.1.7-wso2v145-SNAPSHOT-tests.jar.asc>
[INFO] [INFO] 
[INFO] [INFO] --- maven-bundle-plugin:1.4.0:install (default-install) @ synapse-core ---
[INFO] [INFO] Parsing <https://wso2.org/jenkins/job/forked-dependencies/job/wso2-synapse/ws/.repository/repository.xml>
[INFO] [INFO] Installing org/apache/synapse/synapse-core/2.1.7-wso2v145-SNAPSHOT/synapse-core-2.1.7-wso2v145-SNAPSHOT.jar
[INFO] [INFO] Writing OBR metadata
[INFO] [INFO] 
[INFO] [INFO] --------------< org.apache.synapse:synapse-fix-transport >--------------
[INFO] [INFO] Building Apache Synapse - FIX Transport 2.1.7-wso2v145-SNAPSHOT  [10/30]
[INFO] [INFO] -------------------------------[ bundle ]-------------------------------
[INFO] [INFO] Downloading from wso2.releases: https://maven.wso2.org/nexus/content/repositories/releases/quickfixj/quickfixj-all/1.5.3/quickfixj-all-1.5.3.pom
[INFO] [INFO] Downloading from wso2-nexus: https://maven.wso2.org/nexus/content/groups/wso2-public/quickfixj/quickfixj-all/1.5.3/quickfixj-all-1.5.3.pom
[INFO] [INFO] Downloading from 3rd-party: https://maven.wso2.org/nexus/content/repositories/thirdparty/quickfixj/quickfixj-all/1.5.3/quickfixj-all-1.5.3.pom
[INFO] [INFO] Downloading from shibboleth.internet2.edu: https://build.shibboleth.net/nexus/content/groups/public/quickfixj/quickfixj-all/1.5.3/quickfixj-all-1.5.3.pom
[INFO] [INFO] Downloading from shibboleth-release: https://build.shibboleth.net/nexus/content/groups/public/quickfixj/quickfixj-all/1.5.3/quickfixj-all-1.5.3.pom
[INFO] [INFO] Downloading from central: https://repo.maven.apache.org/maven2/quickfixj/quickfixj-all/1.5.3/quickfixj-all-1.5.3.pom
[INFO] [INFO] ------------------------------------------------------------------------
[INFO] [INFO] Reactor Summary for Apache Synapse 2.1.7-wso2v145-SNAPSHOT:
[INFO] [INFO] 
[INFO] [INFO] Apache Synapse ..................................... SUCCESS [  8.990 s]
[INFO] [INFO] Apache Synapse - Secure vault ...................... SUCCESS [01:16 min]
[INFO] [INFO] Apache Synapse - Commons classes ................... SUCCESS [ 37.656 s]
[INFO] [INFO] Apache Synapse - Transports ........................ SUCCESS [  0.903 s]
[INFO] [INFO] Apache Synapse - Non-blocking HTTP/s Transport ..... SUCCESS [ 20.633 s]
[INFO] [INFO] Apache Synapse - PIPE Transport .................... SUCCESS [  1.803 s]
[INFO] [INFO] Apache Synapse - VFS Transport ..................... SUCCESS [  7.836 s]
[INFO] [INFO] Apache Synapse - Tasks classes ..................... SUCCESS [  2.737 s]
[INFO] [INFO] Apache Synapse - Core .............................. SUCCESS [04:01 min]
[INFO] [INFO] Apache Synapse - FIX Transport ..................... FAILURE [  0.199 s]
[INFO] [INFO] Apache Synapse - Extensions ........................ SKIPPED
[INFO] [INFO] Apache Synapse - Samples ........................... SKIPPED
[INFO] [INFO] WSO2 Carbon - Synapse Feature Aggregator Module .... SKIPPED
[INFO] [INFO] WSO2 Carbon - Synapse Feature ...................... SKIPPED
[INFO] [INFO] WSO2 Carbon - Synapse FIX Transport Feature ........ SKIPPED
[INFO] [INFO] WSO2 Carbon - Synapse Nhttp Transport Feature ...... SKIPPED
[INFO] [INFO] WSO2 Carbon - Synapse VFS Transport Feature ........ SKIPPED
[INFO] [INFO] WSO2 Carbon - Synapse VFS Transport's SMB supports Feature SKIPPED
[INFO] [INFO] WSO2 Carbon - Synapse Samples Feature .............. SKIPPED
[INFO] [INFO] Apache Synapse - Patches ........................... SKIPPED
[INFO] [INFO] Apache Synapse - Experimental code ................. SKIPPED
[INFO] [INFO] Apache Synapse - Web Application ................... SKIPPED
[INFO] [INFO] Apache Synapse - Handler Module .................... SKIPPED
[INFO] [INFO] Apache Synapse - XAR Maven Plugin .................. SKIPPED
[INFO] [INFO] Apache Synapse - Configuration Migrator ............ SKIPPED
[INFO] [INFO] Apache Synapse - Distribution ...................... SKIPPED
[INFO] [INFO] Apache Synapse - Package skeleton ZIP .............. SKIPPED
[INFO] [INFO] Apache Synapse - Package archetype ................. SKIPPED
[INFO] [INFO] Apache Synapse - Integration ....................... SKIPPED
[INFO] [INFO] Apache Synapse - Code Coverage ..................... SKIPPED
[INFO] [INFO] ------------------------------------------------------------------------
[INFO] [INFO] BUILD FAILURE
[INFO] [INFO] ------------------------------------------------------------------------
[INFO] [INFO] Total time:  06:40 min
[INFO] [INFO] Finished at: 2020-02-13T09:33:24Z
[INFO] [INFO] ------------------------------------------------------------------------
[INFO] [ERROR] Failed to execute goal on project synapse-fix-transport: Could not resolve dependencies for project org.apache.synapse:synapse-fix-transport:bundle:2.1.7-wso2v145-SNAPSHOT: Failed to collect dependencies at quickfixj:quickfixj-all:jar:1.5.3: Failed to read artifact descriptor for quickfixj:quickfixj-all:jar:1.5.3: Could not transfer artifact quickfixj:quickfixj-all:pom:1.5.3 from/to shibboleth.internet2.edu (https://build.shibboleth.net/nexus/content/groups/public/): Transfer failed for https://build.shibboleth.net/nexus/content/groups/public/quickfixj/quickfixj-all/1.5.3/quickfixj-all-1.5.3.pom 503 Service Unavailable -> [Help 1]
[INFO] [ERROR] 
[INFO] [ERROR] To see the full stack trace of the errors, re-run Maven with the -e switch.
[INFO] [ERROR] Re-run Maven using the -X switch to enable full debug logging.
[INFO] [ERROR] 
[INFO] [ERROR] For more information about the errors and possible solutions, please read the following articles:
[INFO] [ERROR] [Help 1] http://cwiki.apache.org/confluence/display/MAVEN/DependencyResolutionException
[INFO] [ERROR] 
[INFO] [ERROR] After correcting the problems, you can resume the build with the command
[INFO] [ERROR]   mvn <args> -rf :synapse-fix-transport
[INFO] ------------------------------------------------------------------------
[INFO] Reactor Summary for Apache Synapse 2.1.7-wso2v145-SNAPSHOT:
[INFO] 
[INFO] Apache Synapse ..................................... FAILURE [06:46 min]
[INFO] Apache Synapse - Secure vault ...................... SKIPPED
[INFO] Apache Synapse - Commons classes ................... SKIPPED
[INFO] Apache Synapse - Transports ........................ SKIPPED
[INFO] Apache Synapse - Non-blocking HTTP/s Transport ..... SKIPPED
[INFO] Apache Synapse - PIPE Transport .................... SKIPPED
[INFO] Apache Synapse - VFS Transport ..................... SKIPPED
[INFO] Apache Synapse - Tasks classes ..................... SKIPPED
[INFO] Apache Synapse - Core .............................. SKIPPED
[INFO] Apache Synapse - FIX Transport ..................... SKIPPED
[INFO] Apache Synapse - Extensions ........................ SKIPPED
[INFO] Apache Synapse - Samples ........................... SKIPPED
[INFO] WSO2 Carbon - Synapse Feature Aggregator Module .... SKIPPED
[INFO] WSO2 Carbon - Synapse Feature ...................... SKIPPED
[INFO] WSO2 Carbon - Synapse FIX Transport Feature ........ SKIPPED
[INFO] WSO2 Carbon - Synapse Nhttp Transport Feature ...... SKIPPED
[INFO] WSO2 Carbon - Synapse VFS Transport Feature ........ SKIPPED
[INFO] WSO2 Carbon - Synapse VFS Transport's SMB supports Feature SKIPPED
[INFO] WSO2 Carbon - Synapse Samples Feature .............. SKIPPED
[INFO] Apache Synapse - Patches ........................... SKIPPED
[INFO] Apache Synapse - Experimental code ................. SKIPPED
[INFO] Apache Synapse - Web Application ................... SKIPPED
[INFO] Apache Synapse - Handler Module .................... SKIPPED
[INFO] Apache Synapse - XAR Maven Plugin .................. SKIPPED
[INFO] Apache Synapse - Configuration Migrator ............ SKIPPED
[INFO] Apache Synapse - Distribution ...................... SKIPPED
[INFO] Apache Synapse - Package skeleton ZIP .............. SKIPPED
[INFO] Apache Synapse - Package archetype ................. SKIPPED
[INFO] Apache Synapse - Integration ....................... SKIPPED
[INFO] Apache Synapse - Code Coverage ..................... SKIPPED
[INFO] ------------------------------------------------------------------------
[INFO] BUILD FAILURE
[INFO] ------------------------------------------------------------------------
[INFO] Total time:  09:31 min
[INFO] Finished at: 2020-02-13T09:33:35Z
[INFO] ------------------------------------------------------------------------
Waiting for Jenkins to finish collecting data
[ERROR] Failed to execute goal org.apache.maven.plugins:maven-release-plugin:2.5.1:prepare (default-cli) on project Apache-Synapse: Maven execution failed, exit code: '1' -> [Help 1]
[ERROR] 
[ERROR] To see the full stack trace of the errors, re-run Maven with the -e switch.
[ERROR] Re-run Maven using the -X switch to enable full debug logging.
[ERROR] 
[ERROR] For more information about the errors and possible solutions, please read the following articles:
[ERROR] [Help 1] http://cwiki.apache.org/confluence/display/MAVEN/MojoExecutionException
[JENKINS] Archiving <https://wso2.org/jenkins/job/forked-dependencies/job/wso2-synapse/ws/modules/transports/optional/fix/pom.xml> to org.apache.synapse/synapse-fix-transport/2.1.7-wso2v145-SNAPSHOT/synapse-fix-transport-2.1.7-wso2v145-SNAPSHOT.pom
[JENKINS] Archiving <https://wso2.org/jenkins/job/forked-dependencies/job/wso2-synapse/ws/modules/securevault/pom.xml> to org.apache.synapse/synapse-securevault/2.1.7-wso2v145-SNAPSHOT/synapse-securevault-2.1.7-wso2v145-SNAPSHOT.pom
[JENKINS] Archiving <https://wso2.org/jenkins/job/forked-dependencies/job/wso2-synapse/ws/modules/commons/pom.xml> to org.apache.synapse/synapse-commons/2.1.7-wso2v145-SNAPSHOT/synapse-commons-2.1.7-wso2v145-SNAPSHOT.pom
[JENKINS] Archiving <https://wso2.org/jenkins/job/forked-dependencies/job/wso2-synapse/ws/modules/coverage-report/pom.xml> to org.apache.synapse/synapse-code-coverage/2.1.7-wso2v145-SNAPSHOT/synapse-code-coverage-2.1.7-wso2v145-SNAPSHOT.pom
[JENKINS] Archiving <https://wso2.org/jenkins/job/forked-dependencies/job/wso2-synapse/ws/modules/features/org.apache.synapse.wso2.feature/pom.xml> to org.apache.synapse/org.apache.synapse.wso2.feature/2.1.7-wso2v145-SNAPSHOT/org.apache.synapse.wso2.feature-2.1.7-wso2v145-SNAPSHOT.pom
[JENKINS] Archiving <https://wso2.org/jenkins/job/forked-dependencies/job/wso2-synapse/ws/modules/features/org.apache.synapse.transport.vfs.smb.feature/pom.xml> to org.apache.synapse/org.apache.synapse.transport.vfs.smb.feature/2.1.7-wso2v145-SNAPSHOT/org.apache.synapse.transport.vfs.smb.feature-2.1.7-wso2v145-SNAPSHOT.pom
[JENKINS] Archiving <https://wso2.org/jenkins/job/forked-dependencies/job/wso2-synapse/ws/modules/war/pom.xml> to org.apache.synapse/synapse-war/2.1.7-wso2v145-SNAPSHOT/synapse-war-2.1.7-wso2v145-SNAPSHOT.pom
[JENKINS] Archiving <https://wso2.org/jenkins/job/forked-dependencies/job/wso2-synapse/ws/pom.xml> to org.apache.synapse/Apache-Synapse/2.1.7-wso2v145-SNAPSHOT/Apache-Synapse-2.1.7-wso2v145-SNAPSHOT.pom
[JENKINS] Archiving <https://wso2.org/jenkins/job/forked-dependencies/job/wso2-synapse/ws/modules/extensions/pom.xml> to org.apache.synapse/synapse-extensions/2.1.7-wso2v145-SNAPSHOT/synapse-extensions-2.1.7-wso2v145-SNAPSHOT.pom
[JENKINS] Archiving <https://wso2.org/jenkins/job/forked-dependencies/job/wso2-synapse/ws/modules/handler/pom.xml> to org.apache.synapse/synapse-handler/2.1.7-wso2v145-SNAPSHOT/synapse-handler-2.1.7-wso2v145-SNAPSHOT.pom
[JENKINS] Archiving <https://wso2.org/jenkins/job/forked-dependencies/job/wso2-synapse/ws/modules/features/pom.xml> to org.apache.synapse/synapse-features/2.1.7-wso2v145-SNAPSHOT/synapse-features-2.1.7-wso2v145-SNAPSHOT.pom
[JENKINS] Archiving <https://wso2.org/jenkins/job/forked-dependencies/job/wso2-synapse/ws/modules/xar-maven-plugin/pom.xml> to org.apache.synapse/synapse-xar-maven-plugin/2.1.7-wso2v145-SNAPSHOT/synapse-xar-maven-plugin-2.1.7-wso2v145-SNAPSHOT.pom
[JENKINS] Archiving <https://wso2.org/jenkins/job/forked-dependencies/job/wso2-synapse/ws/modules/transports/core/pipe/pom.xml> to org.apache.synapse/synapse-pipe-transport/2.1.7-wso2v145-SNAPSHOT/synapse-pipe-transport-2.1.7-wso2v145-SNAPSHOT.pom
[JENKINS] Archiving <https://wso2.org/jenkins/job/forked-dependencies/job/wso2-synapse/ws/modules/patches/pom.xml> to org.apache.synapse/synapse-patches/2.1.7-wso2v145-SNAPSHOT/synapse-patches-2.1.7-wso2v145-SNAPSHOT.pom
[JENKINS] Archiving <https://wso2.org/jenkins/job/forked-dependencies/job/wso2-synapse/ws/modules/transports/pom.xml> to org.apache.synapse/synapse-transports/2.1.7-wso2v145-SNAPSHOT/synapse-transports-2.1.7-wso2v145-SNAPSHOT.pom
[JENKINS] Archiving <https://wso2.org/jenkins/job/forked-dependencies/job/wso2-synapse/ws/modules/migrator/pom.xml> to org.apache.synapse/synapse-config-migrator/2.1.7-wso2v145-SNAPSHOT/synapse-config-migrator-2.1.7-wso2v145-SNAPSHOT.pom
[JENKINS] Archiving <https://wso2.org/jenkins/job/forked-dependencies/job/wso2-synapse/ws/modules/samples/pom.xml> to org.apache.synapse/synapse-samples/2.1.7-wso2v145-SNAPSHOT/synapse-samples-2.1.7-wso2v145-SNAPSHOT.pom
[JENKINS] Archiving <https://wso2.org/jenkins/job/forked-dependencies/job/wso2-synapse/ws/modules/features/org.apache.synapse.transport.nhttp.feature/pom.xml> to org.apache.synapse/org.apache.synapse.transport.nhttp.feature/2.1.7-wso2v145-SNAPSHOT/org.apache.synapse.transport.nhttp.feature-2.1.7-wso2v145-SNAPSHOT.pom
[JENKINS] Archiving <https://wso2.org/jenkins/job/forked-dependencies/job/wso2-synapse/ws/modules/features/org.apache.synapse.transport.vfs.feature/pom.xml> to org.apache.synapse/org.apache.synapse.transport.vfs.feature/2.1.7-wso2v145-SNAPSHOT/org.apache.synapse.transport.vfs.feature-2.1.7-wso2v145-SNAPSHOT.pom
[JENKINS] Archiving <https://wso2.org/jenkins/job/forked-dependencies/job/wso2-synapse/ws/modules/features/org.apache.synapse.samples.feature/pom.xml> to org.apache.synapse/org.apache.synapse.samples.feature/2.1.7-wso2v145-SNAPSHOT/org.apache.synapse.samples.feature-2.1.7-wso2v145-SNAPSHOT.pom
[JENKINS] Archiving <https://wso2.org/jenkins/job/forked-dependencies/job/wso2-synapse/ws/modules/tasks/pom.xml> to org.apache.synapse/synapse-tasks/2.1.7-wso2v145-SNAPSHOT/synapse-tasks-2.1.7-wso2v145-SNAPSHOT.pom
[JENKINS] Archiving <https://wso2.org/jenkins/job/forked-dependencies/job/wso2-synapse/ws/modules/packaging/package-archetype/pom.xml> to org.apache.synapse/synapse-package-archetype/2.1.7-wso2v145-SNAPSHOT/synapse-package-archetype-2.1.7-wso2v145-SNAPSHOT.pom
[JENKINS] Archiving <https://wso2.org/jenkins/job/forked-dependencies/job/wso2-synapse/ws/modules/transports/core/nhttp/pom.xml> to org.apache.synapse/synapse-nhttp-transport/2.1.7-wso2v145-SNAPSHOT/synapse-nhttp-transport-2.1.7-wso2v145-SNAPSHOT.pom
[JENKINS] Archiving <https://wso2.org/jenkins/job/forked-dependencies/job/wso2-synapse/ws/modules/transports/core/vfs/pom.xml> to org.apache.synapse/synapse-vfs-transport/2.1.7-wso2v145-SNAPSHOT/synapse-vfs-transport-2.1.7-wso2v145-SNAPSHOT.pom
[JENKINS] Archiving <https://wso2.org/jenkins/job/forked-dependencies/job/wso2-synapse/ws/modules/packaging/package-skeleton/pom.xml> to org.apache.synapse/synapse-package-skeleton/2.1.7-wso2v145-SNAPSHOT/synapse-package-skeleton-2.1.7-wso2v145-SNAPSHOT.pom
[JENKINS] Archiving <https://wso2.org/jenkins/job/forked-dependencies/job/wso2-synapse/ws/modules/integration/pom.xml> to org.apache.synapse/synapse-integration/2.1.7-wso2v145-SNAPSHOT/synapse-integration-2.1.7-wso2v145-SNAPSHOT.pom
[JENKINS] Archiving <https://wso2.org/jenkins/job/forked-dependencies/job/wso2-synapse/ws/modules/core/pom.xml> to org.apache.synapse/synapse-core/2.1.7-wso2v145-SNAPSHOT/synapse-core-2.1.7-wso2v145-SNAPSHOT.pom
[JENKINS] Archiving <https://wso2.org/jenkins/job/forked-dependencies/job/wso2-synapse/ws/modules/features/org.apache.synapse.transport.fix.feature/pom.xml> to org.apache.synapse/org.apache.synapse.transport.fix.feature/2.1.7-wso2v145-SNAPSHOT/org.apache.synapse.transport.fix.feature-2.1.7-wso2v145-SNAPSHOT.pom
[JENKINS] Archiving <https://wso2.org/jenkins/job/forked-dependencies/job/wso2-synapse/ws/modules/distribution/pom.xml> to org.apache.synapse/synapse-distribution/2.1.7-wso2v145-SNAPSHOT/synapse-distribution-2.1.7-wso2v145-SNAPSHOT.pom
[JENKINS] Archiving <https://wso2.org/jenkins/job/forked-dependencies/job/wso2-synapse/ws/modules/experimental/pom.xml> to org.apache.synapse/synapse-experimental/2.1.7-wso2v145-SNAPSHOT/synapse-experimental-2.1.7-wso2v145-SNAPSHOT.pom
No mail will be sent out, as 'forked-dependencies » wso2-synapse » Apache Synapse - FIX Transport #4569' does not have a result yet. Please make sure you set a proper result in case of pipeline/build scripts.
No mail will be sent out, as 'forked-dependencies » wso2-synapse » Apache Synapse - Secure vault #4569' does not have a result yet. Please make sure you set a proper result in case of pipeline/build scripts.
No mail will be sent out, as 'forked-dependencies » wso2-synapse » Apache Synapse - Commons classes #4569' does not have a result yet. Please make sure you set a proper result in case of pipeline/build scripts.
No mail will be sent out, as 'forked-dependencies » wso2-synapse » Apache Synapse - Code Coverage #4569' does not have a result yet. Please make sure you set a proper result in case of pipeline/build scripts.
No mail will be sent out, as 'forked-dependencies » wso2-synapse » WSO2 Carbon - Synapse Feature #4569' does not have a result yet. Please make sure you set a proper result in case of pipeline/build scripts.
No mail will be sent out, as 'forked-dependencies » wso2-synapse » WSO2 Carbon - Synapse VFS Transport's SMB supports Feature #4569' does not have a result yet. Please make sure you set a proper result in case of pipeline/build scripts.
No mail will be sent out, as 'forked-dependencies » wso2-synapse » Apache Synapse - Web Application #4569' does not have a result yet. Please make sure you set a proper result in case of pipeline/build scripts.
Sending e-mails to: builder at wso2.org
No mail will be sent out, as 'forked-dependencies » wso2-synapse » Apache Synapse - Extensions #4569' does not have a result yet. Please make sure you set a proper result in case of pipeline/build scripts.
No mail will be sent out, as 'forked-dependencies » wso2-synapse » Apache Synapse - Handler Module #4569' does not have a result yet. Please make sure you set a proper result in case of pipeline/build scripts.
No mail will be sent out, as 'forked-dependencies » wso2-synapse » WSO2 Carbon - Synapse Feature Aggregator Module #4569' does not have a result yet. Please make sure you set a proper result in case of pipeline/build scripts.
No mail will be sent out, as 'forked-dependencies » wso2-synapse » Apache Synapse - XAR Maven Plugin #4569' does not have a result yet. Please make sure you set a proper result in case of pipeline/build scripts.
No mail will be sent out, as 'forked-dependencies » wso2-synapse » Apache Synapse - PIPE Transport #4569' does not have a result yet. Please make sure you set a proper result in case of pipeline/build scripts.
No mail will be sent out, as 'forked-dependencies » wso2-synapse » Apache Synapse - Patches #4569' does not have a result yet. Please make sure you set a proper result in case of pipeline/build scripts.
No mail will be sent out, as 'forked-dependencies » wso2-synapse » Apache Synapse - Transports #4569' does not have a result yet. Please make sure you set a proper result in case of pipeline/build scripts.
No mail will be sent out, as 'forked-dependencies » wso2-synapse » Apache Synapse - Configuration Migrator #4569' does not have a result yet. Please make sure you set a proper result in case of pipeline/build scripts.
No mail will be sent out, as 'forked-dependencies » wso2-synapse » Apache Synapse - Samples #4569' does not have a result yet. Please make sure you set a proper result in case of pipeline/build scripts.
No mail will be sent out, as 'forked-dependencies » wso2-synapse » WSO2 Carbon - Synapse Nhttp Transport Feature #4569' does not have a result yet. Please make sure you set a proper result in case of pipeline/build scripts.
No mail will be sent out, as 'forked-dependencies » wso2-synapse » WSO2 Carbon - Synapse VFS Transport Feature #4569' does not have a result yet. Please make sure you set a proper result in case of pipeline/build scripts.
No mail will be sent out, as 'forked-dependencies » wso2-synapse » WSO2 Carbon - Synapse Samples Feature #4569' does not have a result yet. Please make sure you set a proper result in case of pipeline/build scripts.
No mail will be sent out, as 'forked-dependencies » wso2-synapse » Apache Synapse - Tasks classes #4569' does not have a result yet. Please make sure you set a proper result in case of pipeline/build scripts.
No mail will be sent out, as 'forked-dependencies » wso2-synapse » Apache Synapse - Package archetype #4569' does not have a result yet. Please make sure you set a proper result in case of pipeline/build scripts.
No mail will be sent out, as 'forked-dependencies » wso2-synapse » Apache Synapse - Non-blocking HTTP/s Transport #4569' does not have a result yet. Please make sure you set a proper result in case of pipeline/build scripts.
No mail will be sent out, as 'forked-dependencies » wso2-synapse » Apache Synapse - VFS Transport #4569' does not have a result yet. Please make sure you set a proper result in case of pipeline/build scripts.
No mail will be sent out, as 'forked-dependencies » wso2-synapse » Apache Synapse - Package skeleton ZIP #4569' does not have a result yet. Please make sure you set a proper result in case of pipeline/build scripts.
No mail will be sent out, as 'forked-dependencies » wso2-synapse » Apache Synapse - Integration #4569' does not have a result yet. Please make sure you set a proper result in case of pipeline/build scripts.
No mail will be sent out, as 'forked-dependencies » wso2-synapse » Apache Synapse - Core #4569' does not have a result yet. Please make sure you set a proper result in case of pipeline/build scripts.
No mail will be sent out, as 'forked-dependencies » wso2-synapse » WSO2 Carbon - Synapse FIX Transport Feature #4569' does not have a result yet. Please make sure you set a proper result in case of pipeline/build scripts.
No mail will be sent out, as 'forked-dependencies » wso2-synapse » Apache Synapse - Distribution #4569' does not have a result yet. Please make sure you set a proper result in case of pipeline/build scripts.
No mail will be sent out, as 'forked-dependencies » wso2-synapse » Apache Synapse - Experimental code #4569' does not have a result yet. Please make sure you set a proper result in case of pipeline/build scripts.
[M2Release] its only a dryRun, we should not do any writable operation.
channel stopped


More information about the Builder mailing list