[Builder] Build failed in Jenkins: products » product-microgateway_3.0.x #678

cbuilder at wso2.org cbuilder at wso2.org
Sun Nov 1 13:12:30 PST 2020


See <https://wso2.org/jenkins/job/products/job/product-microgateway_3.0.x/678/display/redirect>

Changes:


------------------------------------------
[...truncated 657.87 KB...]
[INFO] Downloading: http://maven.wso2.org/nexus/content/repositories/releases/org/apache/maven/maven-core/2.0/maven-core-2.0.jar
[INFO] Downloading: http://maven.wso2.org/nexus/content/repositories/releases/org/apache/maven/maven-settings/2.0/maven-settings-2.0.jar
[INFO] Downloading: http://maven.wso2.org/nexus/content/repositories/releases/org/apache/maven/maven-plugin-parameter-documenter/2.0/maven-plugin-parameter-documenter-2.0.jar
[INFO] Downloading: http://maven.wso2.org/nexus/content/repositories/releases/org/apache/maven/reporting/maven-reporting-api/2.0/maven-reporting-api-2.0.jar
[INFO] Downloading: http://maven.wso2.org/nexus/content/repositories/releases/doxia/doxia-sink-api/1.0-alpha-4/doxia-sink-api-1.0-alpha-4.jar
[INFO] Downloading: http://maven.wso2.org/nexus/content/repositories/releases/org/apache/maven/maven-profile/2.0/maven-profile-2.0.jar
[INFO] Downloading: http://maven.wso2.org/nexus/content/repositories/releases/org/apache/maven/maven-model/2.0/maven-model-2.0.jar
[INFO] Downloading: http://maven.wso2.org/nexus/content/repositories/releases/org/codehaus/plexus/plexus-container-default/1.0-alpha-8/plexus-container-default-1.0-alpha-8.jar
[INFO] Downloading: http://maven.wso2.org/nexus/content/repositories/releases/org/apache/maven/maven-repository-metadata/2.0/maven-repository-metadata-2.0.jar
[INFO] Downloading: http://maven.wso2.org/nexus/content/repositories/releases/org/apache/maven/maven-error-diagnostics/2.0/maven-error-diagnostics-2.0.jar
[INFO] Downloading: http://maven.wso2.org/nexus/content/repositories/releases/org/apache/maven/maven-plugin-registry/2.0/maven-plugin-registry-2.0.jar
[INFO] Downloading: http://maven.wso2.org/nexus/content/repositories/releases/org/apache/maven/maven-plugin-descriptor/2.0/maven-plugin-descriptor-2.0.jar
[INFO] Downloading: http://maven.wso2.org/nexus/content/repositories/releases/org/apache/maven/maven-artifact-manager/2.0/maven-artifact-manager-2.0.jar
[INFO] Downloading: http://maven.wso2.org/nexus/content/repositories/releases/org/apache/maven/maven-monitor/2.0/maven-monitor-2.0.jar
[INFO] Downloading: http://maven.wso2.org/nexus/content/repositories/releases/org/apache/maven/maven-plugin-api/2.0/maven-plugin-api-2.0.jar
[INFO] Downloading: http://maven.wso2.org/nexus/content/repositories/releases/org/apache/maven/maven-artifact/2.0/maven-artifact-2.0.jar
[INFO] Downloading: http://maven.wso2.org/nexus/content/repositories/releases/org/apache/maven/maven-project/2.0/maven-project-2.0.jar
[INFO] Downloading: http://maven.wso2.org/nexus/content/repositories/releases/org/apache/httpcomponents/httpclient/4.0-beta2/httpclient-4.0-beta2.jar
[INFO] Downloading: http://maven.wso2.org/nexus/content/repositories/releases/org/apache/httpcomponents/httpcore/4.0-beta3/httpcore-4.0-beta3.jar
[INFO] Downloading: http://maven.wso2.org/nexus/content/repositories/releases/commons-logging/commons-logging/1.1.1/commons-logging-1.1.1.jar
[INFO] Downloading: http://maven.wso2.org/nexus/content/repositories/releases/org/codehaus/plexus/plexus-archiver/3.0.1/plexus-archiver-3.0.1.jar
[INFO] Downloading: http://maven.wso2.org/nexus/content/repositories/releases/org/codehaus/plexus/plexus-io/2.6/plexus-io-2.6.jar
[INFO] Downloading: http://maven.wso2.org/nexus/content/repositories/releases/org/iq80/snappy/snappy/0.3/snappy-0.3.jar
[INFO] Downloading: http://maven.wso2.org/nexus/content/repositories/releases/org/codehaus/plexus/plexus-utils/1.5.4/plexus-utils-1.5.4.jar
[INFO] Downloading: http://maven.wso2.org/nexus/content/repositories/releases/org/apache/maven/wagon/wagon-provider-api/2.5/wagon-provider-api-2.5.jar
[INFO] Downloading: http://maven.wso2.org/nexus/content/repositories/releases/org/sonatype/plexus/plexus-sec-dispatcher/1.4/plexus-sec-dispatcher-1.4.jar
[INFO] Downloading: http://maven.wso2.org/nexus/content/groups/wso2-public/org/apache/maven/maven-core/2.0/maven-core-2.0.jar
[INFO] Downloading: http://maven.wso2.org/nexus/content/groups/wso2-public/org/apache/maven/maven-settings/2.0/maven-settings-2.0.jar
[INFO] Downloading: http://maven.wso2.org/nexus/content/groups/wso2-public/org/apache/maven/maven-plugin-parameter-documenter/2.0/maven-plugin-parameter-documenter-2.0.jar
[INFO] Downloading: http://maven.wso2.org/nexus/content/groups/wso2-public/org/apache/maven/reporting/maven-reporting-api/2.0/maven-reporting-api-2.0.jar
[INFO] Downloading: http://maven.wso2.org/nexus/content/groups/wso2-public/doxia/doxia-sink-api/1.0-alpha-4/doxia-sink-api-1.0-alpha-4.jar
[INFO] Downloaded: http://maven.wso2.org/nexus/content/groups/wso2-public/org/apache/maven/reporting/maven-reporting-api/2.0/maven-reporting-api-2.0.jar (7 KB at 82.2 KB/sec)
[INFO] Downloading: http://maven.wso2.org/nexus/content/groups/wso2-public/org/apache/maven/maven-profile/2.0/maven-profile-2.0.jar
[INFO] Downloaded: http://maven.wso2.org/nexus/content/groups/wso2-public/org/apache/maven/maven-plugin-parameter-documenter/2.0/maven-plugin-parameter-documenter-2.0.jar (18 KB at 179.3 KB/sec)
[INFO] Downloading: http://maven.wso2.org/nexus/content/groups/wso2-public/org/apache/maven/maven-model/2.0/maven-model-2.0.jar
[INFO] Downloaded: http://maven.wso2.org/nexus/content/groups/wso2-public/doxia/doxia-sink-api/1.0-alpha-4/doxia-sink-api-1.0-alpha-4.jar (5 KB at 42.2 KB/sec)
[INFO] Downloading: http://maven.wso2.org/nexus/content/groups/wso2-public/org/codehaus/plexus/plexus-container-default/1.0-alpha-8/plexus-container-default-1.0-alpha-8.jar
[INFO] Downloaded: http://maven.wso2.org/nexus/content/groups/wso2-public/org/apache/maven/maven-settings/2.0/maven-settings-2.0.jar (43 KB at 402.6 KB/sec)
[INFO] Downloading: http://maven.wso2.org/nexus/content/groups/wso2-public/org/apache/maven/maven-repository-metadata/2.0/maven-repository-metadata-2.0.jar
[INFO] Downloaded: http://maven.wso2.org/nexus/content/groups/wso2-public/org/apache/maven/maven-core/2.0/maven-core-2.0.jar (133 KB at 1122.5 KB/sec)
[INFO] Downloading: http://maven.wso2.org/nexus/content/groups/wso2-public/org/apache/maven/maven-error-diagnostics/2.0/maven-error-diagnostics-2.0.jar
[INFO] Downloaded: http://maven.wso2.org/nexus/content/groups/wso2-public/org/codehaus/plexus/plexus-container-default/1.0-alpha-8/plexus-container-default-1.0-alpha-8.jar (191 KB at 1192.8 KB/sec)
[INFO] Downloading: http://maven.wso2.org/nexus/content/groups/wso2-public/org/apache/maven/maven-plugin-registry/2.0/maven-plugin-registry-2.0.jar
[INFO] Downloaded: http://maven.wso2.org/nexus/content/groups/wso2-public/org/apache/maven/maven-error-diagnostics/2.0/maven-error-diagnostics-2.0.jar (11 KB at 50.8 KB/sec)
[INFO] Downloading: http://maven.wso2.org/nexus/content/groups/wso2-public/org/apache/maven/maven-plugin-descriptor/2.0/maven-plugin-descriptor-2.0.jar
[INFO] Downloaded: http://maven.wso2.org/nexus/content/groups/wso2-public/org/apache/maven/maven-profile/2.0/maven-profile-2.0.jar (30 KB at 136.8 KB/sec)
[INFO] Downloading: http://maven.wso2.org/nexus/content/groups/wso2-public/org/apache/maven/maven-artifact-manager/2.0/maven-artifact-manager-2.0.jar
[INFO] Downloaded: http://maven.wso2.org/nexus/content/groups/wso2-public/org/apache/maven/maven-repository-metadata/2.0/maven-repository-metadata-2.0.jar (21 KB at 92.1 KB/sec)
[INFO] Downloading: http://maven.wso2.org/nexus/content/groups/wso2-public/org/apache/maven/maven-monitor/2.0/maven-monitor-2.0.jar
[INFO] Downloaded: http://maven.wso2.org/nexus/content/groups/wso2-public/org/apache/maven/maven-model/2.0/maven-model-2.0.jar (77 KB at 330.3 KB/sec)
[INFO] Downloading: http://maven.wso2.org/nexus/content/groups/wso2-public/org/apache/maven/maven-plugin-api/2.0/maven-plugin-api-2.0.jar
[INFO] Downloaded: http://maven.wso2.org/nexus/content/groups/wso2-public/org/apache/maven/maven-plugin-api/2.0/maven-plugin-api-2.0.jar (10 KB at 40.9 KB/sec)
[INFO] Downloading: http://maven.wso2.org/nexus/content/groups/wso2-public/org/apache/maven/maven-artifact/2.0/maven-artifact-2.0.jar
[INFO] Downloaded: http://maven.wso2.org/nexus/content/groups/wso2-public/org/apache/maven/maven-monitor/2.0/maven-monitor-2.0.jar (8 KB at 25.3 KB/sec)
[INFO] Downloading: http://maven.wso2.org/nexus/content/groups/wso2-public/org/apache/maven/maven-project/2.0/maven-project-2.0.jar
[INFO] Downloaded: http://maven.wso2.org/nexus/content/groups/wso2-public/org/apache/maven/maven-plugin-registry/2.0/maven-plugin-registry-2.0.jar (25 KB at 80.7 KB/sec)
[INFO] Downloading: http://maven.wso2.org/nexus/content/groups/wso2-public/org/apache/httpcomponents/httpclient/4.0-beta2/httpclient-4.0-beta2.jar
[INFO] Downloaded: http://maven.wso2.org/nexus/content/groups/wso2-public/org/apache/maven/maven-artifact-manager/2.0/maven-artifact-manager-2.0.jar (50 KB at 159.5 KB/sec)
[INFO] Downloading: http://maven.wso2.org/nexus/content/groups/wso2-public/org/apache/httpcomponents/httpcore/4.0-beta3/httpcore-4.0-beta3.jar
[INFO] Downloaded: http://maven.wso2.org/nexus/content/groups/wso2-public/org/apache/maven/maven-plugin-descriptor/2.0/maven-plugin-descriptor-2.0.jar (33 KB at 98.6 KB/sec)
[INFO] Downloading: http://maven.wso2.org/nexus/content/groups/wso2-public/commons-logging/commons-logging/1.1.1/commons-logging-1.1.1.jar
[INFO] Downloaded: http://maven.wso2.org/nexus/content/groups/wso2-public/org/apache/maven/maven-artifact/2.0/maven-artifact-2.0.jar (77 KB at 231.0 KB/sec)
[INFO] Downloading: http://maven.wso2.org/nexus/content/groups/wso2-public/org/codehaus/plexus/plexus-archiver/3.0.1/plexus-archiver-3.0.1.jar
[INFO] Downloaded: http://maven.wso2.org/nexus/content/groups/wso2-public/org/apache/maven/maven-project/2.0/maven-project-2.0.jar (103 KB at 256.7 KB/sec)
[INFO] Downloading: http://maven.wso2.org/nexus/content/groups/wso2-public/org/codehaus/plexus/plexus-io/2.6/plexus-io-2.6.jar
[INFO] Downloaded: http://maven.wso2.org/nexus/content/groups/wso2-public/commons-logging/commons-logging/1.1.1/commons-logging-1.1.1.jar (60 KB at 140.1 KB/sec)
[INFO] Downloading: http://maven.wso2.org/nexus/content/groups/wso2-public/org/iq80/snappy/snappy/0.3/snappy-0.3.jar
[INFO] Downloaded: http://maven.wso2.org/nexus/content/groups/wso2-public/org/apache/httpcomponents/httpcore/4.0-beta3/httpcore-4.0-beta3.jar (169 KB at 387.5 KB/sec)
[INFO] Downloading: http://maven.wso2.org/nexus/content/groups/wso2-public/org/codehaus/plexus/plexus-utils/1.5.4/plexus-utils-1.5.4.jar
[INFO] Downloaded: http://maven.wso2.org/nexus/content/groups/wso2-public/org/apache/httpcomponents/httpclient/4.0-beta2/httpclient-4.0-beta2.jar (270 KB at 583.9 KB/sec)
[INFO] Downloading: http://maven.wso2.org/nexus/content/groups/wso2-public/org/apache/maven/wagon/wagon-provider-api/2.5/wagon-provider-api-2.5.jar
[INFO] Downloaded: http://maven.wso2.org/nexus/content/groups/wso2-public/org/iq80/snappy/snappy/0.3/snappy-0.3.jar (48 KB at 87.1 KB/sec)
[INFO] Downloading: http://maven.wso2.org/nexus/content/groups/wso2-public/org/sonatype/plexus/plexus-sec-dispatcher/1.4/plexus-sec-dispatcher-1.4.jar
[INFO] Downloaded: http://maven.wso2.org/nexus/content/groups/wso2-public/org/codehaus/plexus/plexus-io/2.6/plexus-io-2.6.jar (83 KB at 149.9 KB/sec)
[INFO] Downloaded: http://maven.wso2.org/nexus/content/groups/wso2-public/org/codehaus/plexus/plexus-archiver/3.0.1/plexus-archiver-3.0.1.jar (373 KB at 676.4 KB/sec)
[INFO] Downloaded: http://maven.wso2.org/nexus/content/groups/wso2-public/org/sonatype/plexus/plexus-sec-dispatcher/1.4/plexus-sec-dispatcher-1.4.jar (28 KB at 49.0 KB/sec)
[INFO] Downloaded: http://maven.wso2.org/nexus/content/groups/wso2-public/org/apache/maven/wagon/wagon-provider-api/2.5/wagon-provider-api-2.5.jar (52 KB at 89.1 KB/sec)
[INFO] Downloaded: http://maven.wso2.org/nexus/content/groups/wso2-public/org/codehaus/plexus/plexus-utils/1.5.4/plexus-utils-1.5.4.jar (245 KB at 415.5 KB/sec)
[WARNING] Could not get content
org.apache.maven.wagon.TransferFailedException: product-dist.ballerina.io: Name or service not known
	at org.apache.maven.wagon.providers.http.AbstractHttpClientWagon.fillInputData(AbstractHttpClientWagon.java:1066)
	at org.apache.maven.wagon.providers.http.AbstractHttpClientWagon.fillInputData(AbstractHttpClientWagon.java:960)
	at org.apache.maven.wagon.StreamWagon.getInputStream(StreamWagon.java:116)
	at org.apache.maven.wagon.StreamWagon.getIfNewer(StreamWagon.java:88)
	at org.apache.maven.wagon.StreamWagon.get(StreamWagon.java:61)
	at com.googlecode.download.maven.plugin.internal.WGet.doGet(WGet.java:374)
	at com.googlecode.download.maven.plugin.internal.WGet.execute(WGet.java:284)
	at org.apache.maven.plugin.DefaultBuildPluginManager.executeMojo(DefaultBuildPluginManager.java:134)
	at org.apache.maven.lifecycle.internal.MojoExecutor.execute(MojoExecutor.java:207)
	at org.apache.maven.lifecycle.internal.MojoExecutor.execute(MojoExecutor.java:153)
	at org.apache.maven.lifecycle.internal.MojoExecutor.execute(MojoExecutor.java:145)
	at org.apache.maven.lifecycle.internal.LifecycleModuleBuilder.buildProject(LifecycleModuleBuilder.java:116)
	at org.apache.maven.lifecycle.internal.LifecycleModuleBuilder.buildProject(LifecycleModuleBuilder.java:80)
	at org.apache.maven.lifecycle.internal.builder.singlethreaded.SingleThreadedBuilder.build(SingleThreadedBuilder.java:51)
	at org.apache.maven.lifecycle.internal.LifecycleStarter.execute(LifecycleStarter.java:128)
	at org.apache.maven.DefaultMaven.doExecute(DefaultMaven.java:307)
	at org.apache.maven.DefaultMaven.doExecute(DefaultMaven.java:193)
	at org.apache.maven.DefaultMaven.execute(DefaultMaven.java:106)
	at org.jvnet.hudson.maven3.launcher.Maven33Launcher.main(Maven33Launcher.java:129)
	at sun.reflect.NativeMethodAccessorImpl.invoke0(Native Method)
	at sun.reflect.NativeMethodAccessorImpl.invoke(NativeMethodAccessorImpl.java:62)
	at sun.reflect.DelegatingMethodAccessorImpl.invoke(DelegatingMethodAccessorImpl.java:43)
	at java.lang.reflect.Method.invoke(Method.java:498)
	at org.codehaus.plexus.classworlds.launcher.Launcher.launchStandard(Launcher.java:330)
	at org.codehaus.plexus.classworlds.launcher.Launcher.launch(Launcher.java:238)
	at jenkins.maven3.agent.Maven33Main.launch(Maven33Main.java:178)
	at sun.reflect.NativeMethodAccessorImpl.invoke0(Native Method)
	at sun.reflect.NativeMethodAccessorImpl.invoke(NativeMethodAccessorImpl.java:62)
	at sun.reflect.DelegatingMethodAccessorImpl.invoke(DelegatingMethodAccessorImpl.java:43)
	at java.lang.reflect.Method.invoke(Method.java:498)
	at hudson.maven.Maven3Builder.call(Maven3Builder.java:139)
	at hudson.maven.Maven3Builder.call(Maven3Builder.java:70)
	at hudson.remoting.UserRequest.perform(UserRequest.java:153)
	at hudson.remoting.UserRequest.perform(UserRequest.java:50)
	at hudson.remoting.Request$2.run(Request.java:336)
	at hudson.remoting.InterceptingExecutorService$1.call(InterceptingExecutorService.java:68)
	at java.util.concurrent.FutureTask.run(FutureTask.java:266)
	at java.util.concurrent.ThreadPoolExecutor.runWorker(ThreadPoolExecutor.java:1149)
	at java.util.concurrent.ThreadPoolExecutor$Worker.run(ThreadPoolExecutor.java:624)
	at java.lang.Thread.run(Thread.java:748)
Caused by: java.net.UnknownHostException: product-dist.ballerina.io: Name or service not known
	at java.net.Inet4AddressImpl.lookupAllHostAddr(Native Method)
	at java.net.InetAddress$2.lookupAllHostAddr(InetAddress.java:928)
	at java.net.InetAddress.getAddressesFromNameService(InetAddress.java:1323)
	at java.net.InetAddress.getAllByName0(InetAddress.java:1276)
	at java.net.InetAddress.getAllByName(InetAddress.java:1192)
	at java.net.InetAddress.getAllByName(InetAddress.java:1126)
	at org.apache.maven.wagon.providers.http.httpclient.impl.conn.SystemDefaultDnsResolver.resolve(SystemDefaultDnsResolver.java:44)
	at org.apache.maven.wagon.providers.http.httpclient.impl.conn.HttpClientConnectionOperator.connect(HttpClientConnectionOperator.java:101)
	at org.apache.maven.wagon.providers.http.httpclient.impl.conn.PoolingHttpClientConnectionManager.connect(PoolingHttpClientConnectionManager.java:318)
	at org.apache.maven.wagon.providers.http.httpclient.impl.execchain.MainClientExec.establishRoute(MainClientExec.java:363)
	at org.apache.maven.wagon.providers.http.httpclient.impl.execchain.MainClientExec.execute(MainClientExec.java:219)
	at org.apache.maven.wagon.providers.http.httpclient.impl.execchain.ProtocolExec.execute(ProtocolExec.java:195)
	at org.apache.maven.wagon.providers.http.httpclient.impl.execchain.RetryExec.execute(RetryExec.java:86)
	at org.apache.maven.wagon.providers.http.httpclient.impl.execchain.RedirectExec.execute(RedirectExec.java:108)
	at org.apache.maven.wagon.providers.http.httpclient.impl.client.InternalHttpClient.doExecute(InternalHttpClient.java:184)
	at org.apache.maven.wagon.providers.http.httpclient.impl.client.CloseableHttpClient.execute(CloseableHttpClient.java:82)
	at org.apache.maven.wagon.providers.http.AbstractHttpClientWagon.execute(AbstractHttpClientWagon.java:832)
	at org.apache.maven.wagon.providers.http.AbstractHttpClientWagon.fillInputData(AbstractHttpClientWagon.java:983)
	... 39 more
[WARNING] Retrying (1 more)
[WARNING] Could not get content
org.apache.maven.wagon.TransferFailedException: product-dist.ballerina.io
	at org.apache.maven.wagon.providers.http.AbstractHttpClientWagon.fillInputData(AbstractHttpClientWagon.java:1066)
	at org.apache.maven.wagon.providers.http.AbstractHttpClientWagon.fillInputData(AbstractHttpClientWagon.java:960)
	at org.apache.maven.wagon.StreamWagon.getInputStream(StreamWagon.java:116)
	at org.apache.maven.wagon.StreamWagon.getIfNewer(StreamWagon.java:88)
	at org.apache.maven.wagon.StreamWagon.get(StreamWagon.java:61)
	at com.googlecode.download.maven.plugin.internal.WGet.doGet(WGet.java:374)
	at com.googlecode.download.maven.plugin.internal.WGet.execute(WGet.java:284)
	at org.apache.maven.plugin.DefaultBuildPluginManager.executeMojo(DefaultBuildPluginManager.java:134)
	at org.apache.maven.lifecycle.internal.MojoExecutor.execute(MojoExecutor.java:207)
	at org.apache.maven.lifecycle.internal.MojoExecutor.execute(MojoExecutor.java:153)
	at org.apache.maven.lifecycle.internal.MojoExecutor.execute(MojoExecutor.java:145)
	at org.apache.maven.lifecycle.internal.LifecycleModuleBuilder.buildProject(LifecycleModuleBuilder.java:116)
	at org.apache.maven.lifecycle.internal.LifecycleModuleBuilder.buildProject(LifecycleModuleBuilder.java:80)
	at org.apache.maven.lifecycle.internal.builder.singlethreaded.SingleThreadedBuilder.build(SingleThreadedBuilder.java:51)
	at org.apache.maven.lifecycle.internal.LifecycleStarter.execute(LifecycleStarter.java:128)
	at org.apache.maven.DefaultMaven.doExecute(DefaultMaven.java:307)
	at org.apache.maven.DefaultMaven.doExecute(DefaultMaven.java:193)
	at org.apache.maven.DefaultMaven.execute(DefaultMaven.java:106)
	at org.jvnet.hudson.maven3.launcher.Maven33Launcher.main(Maven33Launcher.java:129)
	at sun.reflect.NativeMethodAccessorImpl.invoke0(Native Method)
	at sun.reflect.NativeMethodAccessorImpl.invoke(NativeMethodAccessorImpl.java:62)
	at sun.reflect.DelegatingMethodAccessorImpl.invoke(DelegatingMethodAccessorImpl.java:43)
	at java.lang.reflect.Method.invoke(Method.java:498)
	at org.codehaus.plexus.classworlds.launcher.Launcher.launchStandard(Launcher.java:330)
	at org.codehaus.plexus.classworlds.launcher.Launcher.launch(Launcher.java:238)
	at jenkins.maven3.agent.Maven33Main.launch(Maven33Main.java:178)
	at sun.reflect.NativeMethodAccessorImpl.invoke0(Native Method)
	at sun.reflect.NativeMethodAccessorImpl.invoke(NativeMethodAccessorImpl.java:62)
	at sun.reflect.DelegatingMethodAccessorImpl.invoke(DelegatingMethodAccessorImpl.java:43)
	at java.lang.reflect.Method.invoke(Method.java:498)
	at hudson.maven.Maven3Builder.call(Maven3Builder.java:139)
	at hudson.maven.Maven3Builder.call(Maven3Builder.java:70)
	at hudson.remoting.UserRequest.perform(UserRequest.java:153)
	at hudson.remoting.UserRequest.perform(UserRequest.java:50)
	at hudson.remoting.Request$2.run(Request.java:336)
	at hudson.remoting.InterceptingExecutorService$1.call(InterceptingExecutorService.java:68)
	at java.util.concurrent.FutureTask.run(FutureTask.java:266)
	at java.util.concurrent.ThreadPoolExecutor.runWorker(ThreadPoolExecutor.java:1149)
	at java.util.concurrent.ThreadPoolExecutor$Worker.run(ThreadPoolExecutor.java:624)
	at java.lang.Thread.run(Thread.java:748)
Caused by: java.net.UnknownHostException: product-dist.ballerina.io
	at java.net.InetAddress.getAllByName0(InetAddress.java:1280)
	at java.net.InetAddress.getAllByName(InetAddress.java:1192)
	at java.net.InetAddress.getAllByName(InetAddress.java:1126)
	at org.apache.maven.wagon.providers.http.httpclient.impl.conn.SystemDefaultDnsResolver.resolve(SystemDefaultDnsResolver.java:44)
	at org.apache.maven.wagon.providers.http.httpclient.impl.conn.HttpClientConnectionOperator.connect(HttpClientConnectionOperator.java:101)
	at org.apache.maven.wagon.providers.http.httpclient.impl.conn.PoolingHttpClientConnectionManager.connect(PoolingHttpClientConnectionManager.java:318)
	at org.apache.maven.wagon.providers.http.httpclient.impl.execchain.MainClientExec.establishRoute(MainClientExec.java:363)
	at org.apache.maven.wagon.providers.http.httpclient.impl.execchain.MainClientExec.execute(MainClientExec.java:219)
	at org.apache.maven.wagon.providers.http.httpclient.impl.execchain.ProtocolExec.execute(ProtocolExec.java:195)
	at org.apache.maven.wagon.providers.http.httpclient.impl.execchain.RetryExec.execute(RetryExec.java:86)
	at org.apache.maven.wagon.providers.http.httpclient.impl.execchain.RedirectExec.execute(RedirectExec.java:108)
	at org.apache.maven.wagon.providers.http.httpclient.impl.client.InternalHttpClient.doExecute(InternalHttpClient.java:184)
	at org.apache.maven.wagon.providers.http.httpclient.impl.client.CloseableHttpClient.execute(CloseableHttpClient.java:82)
	at org.apache.maven.wagon.providers.http.AbstractHttpClientWagon.execute(AbstractHttpClientWagon.java:832)
	at org.apache.maven.wagon.providers.http.AbstractHttpClientWagon.fillInputData(AbstractHttpClientWagon.java:983)
	... 39 more
[INFO] ------------------------------------------------------------------------
[INFO] Reactor Summary:
[INFO] 
[INFO] Micro Gateway - Parent ............................. SUCCESS [ 10.322 s]
[INFO] Micro Gateway Components ........................... SUCCESS [  0.576 s]
[INFO] org.wso2.micro.gateway.core ........................ SUCCESS [02:29 min]
[INFO] Micro Gateway Code Generator ....................... SUCCESS [ 52.878 s]
[INFO] Micro Gateway Tools ................................ SUCCESS [  7.926 s]
[INFO] WSO2 Micro Gateway - Distribution .................. FAILURE [ 13.985 s]
[INFO] Micro-GW - Test Integration ........................ SKIPPED
[INFO] ------------------------------------------------------------------------
[INFO] BUILD FAILURE
[INFO] ------------------------------------------------------------------------
[INFO] Total time: 04:12 min
[INFO] Finished at: 2020-11-01T21:10:27+00:00
[INFO] Final Memory: 77M/840M
[INFO] ------------------------------------------------------------------------
Waiting for Jenkins to finish collecting data
[ERROR] Failed to execute goal com.googlecode.maven-download-plugin:download-maven-plugin:1.4.1:wget (download-ballerina-platform) on project wso2am-micro-gw: IO Error: Could not get content -> [Help 1]
[ERROR] 
[ERROR] To see the full stack trace of the errors, re-run Maven with the -e switch.
[ERROR] Re-run Maven using the -X switch to enable full debug logging.
[ERROR] 
[ERROR] For more information about the errors and possible solutions, please read the following articles:
[ERROR] [Help 1] http://cwiki.apache.org/confluence/display/MAVEN/MojoExecutionException
[ERROR] 
[ERROR] After correcting the problems, you can resume the build with the command
[ERROR]   mvn <goals> -rf :wso2am-micro-gw
[JENKINS] Archiving <https://wso2.org/jenkins/job/products/job/product-microgateway_3.0.x/ws/components/micro-gateway-core/pom.xml> to org.wso2.am.microgw/org.wso2.micro.gateway.core/3.0.5-SNAPSHOT/org.wso2.micro.gateway.core-3.0.5-SNAPSHOT.pom
[JENKINS] Archiving <https://wso2.org/jenkins/job/products/job/product-microgateway_3.0.x/ws/components/micro-gateway-core/target/org.wso2.micro.gateway.core-3.0.5-SNAPSHOT.jar> to org.wso2.am.microgw/org.wso2.micro.gateway.core/3.0.5-SNAPSHOT/org.wso2.micro.gateway.core-3.0.5-SNAPSHOT.jar
[JENKINS] Archiving <https://wso2.org/jenkins/job/products/job/product-microgateway_3.0.x/ws/components/micro-gateway-core/target/org.wso2.micro.gateway.core-3.0.5-SNAPSHOT-ballerina-gateway-sources.zip> to org.wso2.am.microgw/org.wso2.micro.gateway.core/3.0.5-SNAPSHOT/org.wso2.micro.gateway.core-3.0.5-SNAPSHOT-ballerina-gateway-sources.zip
[JENKINS] Archiving <https://wso2.org/jenkins/job/products/job/product-microgateway_3.0.x/ws/components/micro-gateway-core/target/org.wso2.micro.gateway.core-3.0.5-SNAPSHOT-micro-gw-binary-repo.zip> to org.wso2.am.microgw/org.wso2.micro.gateway.core/3.0.5-SNAPSHOT/org.wso2.micro.gateway.core-3.0.5-SNAPSHOT-micro-gw-binary-repo.zip
[JENKINS] Archiving <https://wso2.org/jenkins/job/products/job/product-microgateway_3.0.x/ws/tests/pom.xml> to org.wso2.am.microgw/test-integration/3.0.5-SNAPSHOT/test-integration-3.0.5-SNAPSHOT.pom
[JENKINS] Archiving <https://wso2.org/jenkins/job/products/job/product-microgateway_3.0.x/ws/components/micro-gateway-tools/pom.xml> to org.wso2.am.microgw/org.wso2.micro.gateway.tools/3.0.5-SNAPSHOT/org.wso2.micro.gateway.tools-3.0.5-SNAPSHOT.pom
[JENKINS] Archiving <https://wso2.org/jenkins/job/products/job/product-microgateway_3.0.x/ws/components/micro-gateway-tools/target/org.wso2.micro.gateway.tools-3.0.5-SNAPSHOT-micro-gateway-tools.zip> to org.wso2.am.microgw/org.wso2.micro.gateway.tools/3.0.5-SNAPSHOT/org.wso2.micro.gateway.tools-3.0.5-SNAPSHOT-micro-gateway-tools.zip
[JENKINS] Archiving <https://wso2.org/jenkins/job/products/job/product-microgateway_3.0.x/ws/components/pom.xml> to org.wso2.am.microgw/components/3.0.5-SNAPSHOT/components-3.0.5-SNAPSHOT.pom
[JENKINS] Archiving <https://wso2.org/jenkins/job/products/job/product-microgateway_3.0.x/ws/distribution/pom.xml> to org.wso2.am.microgw/wso2am-micro-gw/3.0.5-SNAPSHOT/wso2am-micro-gw-3.0.5-SNAPSHOT.pom
[JENKINS] Archiving <https://wso2.org/jenkins/job/products/job/product-microgateway_3.0.x/ws/pom.xml> to org.wso2.am.microgw/micro-gateway-parent/3.0.5-SNAPSHOT/micro-gateway-parent-3.0.5-SNAPSHOT.pom
[JENKINS] Archiving <https://wso2.org/jenkins/job/products/job/product-microgateway_3.0.x/ws/components/micro-gateway-cli/dependency-reduced-pom.xml> to org.wso2.am.microgw/org.wso2.micro.gateway.cli/3.0.5-SNAPSHOT/org.wso2.micro.gateway.cli-3.0.5-SNAPSHOT.pom
[JENKINS] Archiving <https://wso2.org/jenkins/job/products/job/product-microgateway_3.0.x/ws/components/micro-gateway-cli/target/org.wso2.micro.gateway.cli-3.0.5-SNAPSHOT.jar> to org.wso2.am.microgw/org.wso2.micro.gateway.cli/3.0.5-SNAPSHOT/org.wso2.micro.gateway.cli-3.0.5-SNAPSHOT.jar
No mail will be sent out, as 'products » product-microgateway_3.0.x » org.wso2.micro.gateway.core #678' does not have a result yet. Please make sure you set a proper result in case of pipeline/build scripts.
No mail will be sent out, as 'products » product-microgateway_3.0.x » Micro-GW - Test Integration #678' does not have a result yet. Please make sure you set a proper result in case of pipeline/build scripts.
No mail will be sent out, as 'products » product-microgateway_3.0.x » Micro Gateway Tools #678' does not have a result yet. Please make sure you set a proper result in case of pipeline/build scripts.
No mail will be sent out, as 'products » product-microgateway_3.0.x » Micro Gateway Components #678' does not have a result yet. Please make sure you set a proper result in case of pipeline/build scripts.
Sending e-mails to: builder at wso2.org
No mail will be sent out, as 'products » product-microgateway_3.0.x » Micro Gateway - Parent #678' does not have a result yet. Please make sure you set a proper result in case of pipeline/build scripts.
No mail will be sent out, as 'products » product-microgateway_3.0.x » Micro Gateway Code Generator #678' does not have a result yet. Please make sure you set a proper result in case of pipeline/build scripts.
channel stopped
Archiving artifacts


More information about the Builder mailing list