[Builder] Build failed in Jenkins: platform-builds » identity-apps #1449

cbuilder at wso2.org cbuilder at wso2.org
Thu Nov 5 06:12:21 PST 2020


See <https://wso2.org/jenkins/job/platform-builds/job/identity-apps/1449/display/redirect?page=changes>

Changes:

[jenkins-bot] [WSO2 Release] [Jenkins #1448] [Release 1.0.514] prepare release v1.0.514

[jenkins-bot] [WSO2 Release] [Jenkins #1448] [Release 1.0.514] prepare for next development iteration

[jenkins-bot] [WSO2 Release][Jenkins #1448]  [Release 1.0.514]  update package versions


------------------------------------------
[...truncated 1.84 MB...]
[INFO] Downloaded from wso2.releases: https://maven.wso2.org/nexus/content/repositories/releases/org/apache/ws/security/wso2/wss4j/1.5.11.wso2v11/wss4j-1.5.11.wso2v11.pom (5.7 kB at 1.8 kB/s)
[INFO] Downloading from wso2.releases: https://maven.wso2.org/nexus/content/repositories/releases/org/apache/ws/security/wss4j-parent/1.5.11-wso2v11/wss4j-parent-1.5.11-wso2v11.pom
[INFO] Downloaded from wso2.releases: https://maven.wso2.org/nexus/content/repositories/releases/org/apache/ws/security/wss4j-parent/1.5.11-wso2v11/wss4j-parent-1.5.11-wso2v11.pom (4.0 kB at 1.8 kB/s)
[INFO] Downloading from wso2.releases: https://maven.wso2.org/nexus/content/repositories/releases/org/apache/axis2/mex/1.6.1-wso2v17/mex-1.6.1-wso2v17.pom
[INFO] Downloaded from wso2.releases: https://maven.wso2.org/nexus/content/repositories/releases/org/apache/axis2/mex/1.6.1-wso2v17/mex-1.6.1-wso2v17.pom (5.2 kB at 2.6 kB/s)
[INFO] Downloading from wso2.releases: https://maven.wso2.org/nexus/content/repositories/releases/org/apache/axis2/axis2-mtompolicy/1.6.1-wso2v17/axis2-mtompolicy-1.6.1-wso2v17.pom
[INFO] Downloaded from wso2.releases: https://maven.wso2.org/nexus/content/repositories/releases/org/apache/axis2/axis2-mtompolicy/1.6.1-wso2v17/axis2-mtompolicy-1.6.1-wso2v17.pom (3.4 kB at 2.1 kB/s)
[INFO] Downloading from wso2.releases: https://maven.wso2.org/nexus/content/repositories/releases/org/apache/axis2/addressing/1.6.1-wso2v17/addressing-1.6.1-wso2v17.pom
[INFO] Downloaded from wso2.releases: https://maven.wso2.org/nexus/content/repositories/releases/org/apache/axis2/addressing/1.6.1-wso2v17/addressing-1.6.1-wso2v17.pom (5.1 kB at 2.8 kB/s)
[INFO] Downloading from wso2.releases: https://maven.wso2.org/nexus/content/repositories/releases/org/apache/ws/commons/axiom/axiom-dom/1.2.11-wso2v10/axiom-dom-1.2.11-wso2v10.pom
[INFO] Downloaded from wso2.releases: https://maven.wso2.org/nexus/content/repositories/releases/org/apache/ws/commons/axiom/axiom-dom/1.2.11-wso2v10/axiom-dom-1.2.11-wso2v10.pom (6.3 kB at 2.2 kB/s)
[INFO] Downloading from wso2.releases: https://maven.wso2.org/nexus/content/repositories/releases/org/apache/ws/security/wss4j/1.5.11-wso2v11/wss4j-1.5.11-wso2v11.pom
[INFO] Downloaded from wso2.releases: https://maven.wso2.org/nexus/content/repositories/releases/org/apache/ws/security/wss4j/1.5.11-wso2v11/wss4j-1.5.11-wso2v11.pom (23 kB at 10 kB/s)
[INFO] Downloading from wso2.releases: https://maven.wso2.org/nexus/content/repositories/releases/org/apache/santuario/xmlsec/1.5.2/xmlsec-1.5.2.pom
[INFO] Downloading from wso2-nexus: https://maven.wso2.org/nexus/content/groups/wso2-public/org/apache/santuario/xmlsec/1.5.2/xmlsec-1.5.2.pom
[INFO] Downloaded from wso2-nexus: https://maven.wso2.org/nexus/content/groups/wso2-public/org/apache/santuario/xmlsec/1.5.2/xmlsec-1.5.2.pom (15 kB at 10 kB/s)
[INFO] Downloading from wso2.releases: https://maven.wso2.org/nexus/content/repositories/releases/org/opensaml/opensaml/2.6.1/opensaml-2.6.1.pom
[INFO] Downloading from wso2-nexus: https://maven.wso2.org/nexus/content/groups/wso2-public/org/opensaml/opensaml/2.6.1/opensaml-2.6.1.pom
[INFO] Downloaded from wso2-nexus: https://maven.wso2.org/nexus/content/groups/wso2-public/org/opensaml/opensaml/2.6.1/opensaml-2.6.1.pom (15 kB at 7.0 kB/s)
[INFO] Downloading from wso2.releases: https://maven.wso2.org/nexus/content/repositories/releases/org/opensaml/openws/1.5.1/openws-1.5.1.pom
[INFO] Downloading from wso2-nexus: https://maven.wso2.org/nexus/content/groups/wso2-public/org/opensaml/openws/1.5.1/openws-1.5.1.pom
[INFO] Downloaded from wso2-nexus: https://maven.wso2.org/nexus/content/groups/wso2-public/org/opensaml/openws/1.5.1/openws-1.5.1.pom (14 kB at 12 kB/s)
[INFO] Downloading from wso2.releases: https://maven.wso2.org/nexus/content/repositories/releases/org/opensaml/xmltooling/1.4.1/xmltooling-1.4.1.pom
[INFO] Downloading from wso2-nexus: https://maven.wso2.org/nexus/content/groups/wso2-public/org/opensaml/xmltooling/1.4.1/xmltooling-1.4.1.pom
[INFO] Downloaded from wso2-nexus: https://maven.wso2.org/nexus/content/groups/wso2-public/org/opensaml/xmltooling/1.4.1/xmltooling-1.4.1.pom (10 kB at 5.7 kB/s)
[INFO] Downloading from wso2.releases: https://maven.wso2.org/nexus/content/repositories/releases/org/bouncycastle/bcprov-jdk15/1.46/bcprov-jdk15-1.46.pom
[INFO] Downloading from wso2-nexus: https://maven.wso2.org/nexus/content/groups/wso2-public/org/bouncycastle/bcprov-jdk15/1.46/bcprov-jdk15-1.46.pom
[INFO] Downloaded from wso2-nexus: https://maven.wso2.org/nexus/content/groups/wso2-public/org/bouncycastle/bcprov-jdk15/1.46/bcprov-jdk15-1.46.pom (819 B at 354 B/s)
[INFO] Downloading from wso2.releases: https://maven.wso2.org/nexus/content/repositories/releases/ca/juliusdavies/not-yet-commons-ssl/0.3.9/not-yet-commons-ssl-0.3.9.pom
[INFO] Downloading from wso2-nexus: https://maven.wso2.org/nexus/content/groups/wso2-public/ca/juliusdavies/not-yet-commons-ssl/0.3.9/not-yet-commons-ssl-0.3.9.pom
[INFO] Downloaded from wso2-nexus: https://maven.wso2.org/nexus/content/groups/wso2-public/ca/juliusdavies/not-yet-commons-ssl/0.3.9/not-yet-commons-ssl-0.3.9.pom (2.6 kB at 409 B/s)
[INFO] Downloading from wso2.releases: https://maven.wso2.org/nexus/content/repositories/releases/commons-httpclient/commons-httpclient/3.0/commons-httpclient-3.0.pom
[INFO] Downloading from wso2-nexus: https://maven.wso2.org/nexus/content/groups/wso2-public/commons-httpclient/commons-httpclient/3.0/commons-httpclient-3.0.pom
[INFO] Downloaded from wso2-nexus: https://maven.wso2.org/nexus/content/groups/wso2-public/commons-httpclient/commons-httpclient/3.0/commons-httpclient-3.0.pom (8.0 kB at 2.1 kB/s)
[INFO] Downloading from wso2.releases: https://maven.wso2.org/nexus/content/repositories/releases/org/apache/santuario/xmlsec/1.5.6/xmlsec-1.5.6.pom
[INFO] Downloading from wso2-nexus: https://maven.wso2.org/nexus/content/groups/wso2-public/org/apache/santuario/xmlsec/1.5.6/xmlsec-1.5.6.pom
[INFO] Downloaded from wso2-nexus: https://maven.wso2.org/nexus/content/groups/wso2-public/org/apache/santuario/xmlsec/1.5.6/xmlsec-1.5.6.pom (16 kB at 18 kB/s)
[INFO] Downloading from wso2.releases: https://maven.wso2.org/nexus/content/repositories/releases/xerces/xercesImpl/2.10.0/xercesImpl-2.10.0.pom
[INFO] Downloading from wso2-nexus: https://maven.wso2.org/nexus/content/groups/wso2-public/xerces/xercesImpl/2.10.0/xercesImpl-2.10.0.pom
[INFO] Downloading from 3rd-party: https://maven.wso2.org/nexus/content/repositories/thirdparty/xerces/xercesImpl/2.10.0/xercesImpl-2.10.0.pom
[INFO] Downloading from shibboleth.internet2.edu: https://build.shibboleth.net/nexus/content/groups/public/xerces/xercesImpl/2.10.0/xercesImpl-2.10.0.pom
[INFO] Downloading from shibboleth-release: https://build.shibboleth.net/nexus/content/groups/public/xerces/xercesImpl/2.10.0/xercesImpl-2.10.0.pom
[INFO] Downloading from central: https://repo.maven.apache.org/maven2/xerces/xercesImpl/2.10.0/xercesImpl-2.10.0.pom
[INFO] Downloaded from central: https://repo.maven.apache.org/maven2/xerces/xercesImpl/2.10.0/xercesImpl-2.10.0.pom (3.2 kB at 213 kB/s)
[INFO] Downloading from wso2.releases: https://maven.wso2.org/nexus/content/repositories/releases/xalan/serializer/2.7.1/serializer-2.7.1.pom
[INFO] Downloading from wso2-nexus: https://maven.wso2.org/nexus/content/groups/wso2-public/xalan/serializer/2.7.1/serializer-2.7.1.pom
[INFO] Downloading from 3rd-party: https://maven.wso2.org/nexus/content/repositories/thirdparty/xalan/serializer/2.7.1/serializer-2.7.1.pom
[INFO] Downloading from shibboleth.internet2.edu: https://build.shibboleth.net/nexus/content/groups/public/xalan/serializer/2.7.1/serializer-2.7.1.pom
[INFO] Downloaded from shibboleth.internet2.edu: https://build.shibboleth.net/nexus/content/groups/public/xalan/serializer/2.7.1/serializer-2.7.1.pom (1.1 kB at 25 kB/s)
[INFO] Downloading from wso2.releases: https://maven.wso2.org/nexus/content/repositories/releases/xml-resolver/xml-resolver/1.2/xml-resolver-1.2.pom
[INFO] Downloading from wso2-nexus: https://maven.wso2.org/nexus/content/groups/wso2-public/xml-resolver/xml-resolver/1.2/xml-resolver-1.2.pom
[INFO] Downloading from 3rd-party: https://maven.wso2.org/nexus/content/repositories/thirdparty/xml-resolver/xml-resolver/1.2/xml-resolver-1.2.pom
[INFO] Downloading from shibboleth.internet2.edu: https://build.shibboleth.net/nexus/content/groups/public/xml-resolver/xml-resolver/1.2/xml-resolver-1.2.pom
[INFO] Downloaded from shibboleth.internet2.edu: https://build.shibboleth.net/nexus/content/groups/public/xml-resolver/xml-resolver/1.2/xml-resolver-1.2.pom (1.6 kB at 49 kB/s)
[INFO] Downloading from wso2.releases: https://maven.wso2.org/nexus/content/repositories/releases/org/slf4j/slf4j-jdk14/1.5.2/slf4j-jdk14-1.5.2.pom
[INFO] Downloading from wso2-nexus: https://maven.wso2.org/nexus/content/groups/wso2-public/org/slf4j/slf4j-jdk14/1.5.2/slf4j-jdk14-1.5.2.pom
[INFO] Downloading from 3rd-party: https://maven.wso2.org/nexus/content/repositories/thirdparty/org/slf4j/slf4j-jdk14/1.5.2/slf4j-jdk14-1.5.2.pom
[INFO] Downloading from shibboleth.internet2.edu: https://build.shibboleth.net/nexus/content/groups/public/org/slf4j/slf4j-jdk14/1.5.2/slf4j-jdk14-1.5.2.pom
[INFO] Downloading from shibboleth-release: https://build.shibboleth.net/nexus/content/groups/public/org/slf4j/slf4j-jdk14/1.5.2/slf4j-jdk14-1.5.2.pom
[INFO] Downloading from central: https://repo.maven.apache.org/maven2/org/slf4j/slf4j-jdk14/1.5.2/slf4j-jdk14-1.5.2.pom
[INFO] Downloaded from central: https://repo.maven.apache.org/maven2/org/slf4j/slf4j-jdk14/1.5.2/slf4j-jdk14-1.5.2.pom (1.7 kB at 420 kB/s)
[INFO] Downloading from wso2.releases: https://maven.wso2.org/nexus/content/repositories/releases/org/slf4j/slf4j-parent/1.5.2/slf4j-parent-1.5.2.pom
[INFO] Downloading from wso2-nexus: https://maven.wso2.org/nexus/content/groups/wso2-public/org/slf4j/slf4j-parent/1.5.2/slf4j-parent-1.5.2.pom
[INFO] Downloading from 3rd-party: https://maven.wso2.org/nexus/content/repositories/thirdparty/org/slf4j/slf4j-parent/1.5.2/slf4j-parent-1.5.2.pom
[INFO] Downloading from shibboleth.internet2.edu: https://build.shibboleth.net/nexus/content/groups/public/org/slf4j/slf4j-parent/1.5.2/slf4j-parent-1.5.2.pom
[INFO] Downloading from shibboleth-release: https://build.shibboleth.net/nexus/content/groups/public/org/slf4j/slf4j-parent/1.5.2/slf4j-parent-1.5.2.pom
[INFO] Downloading from central: https://repo.maven.apache.org/maven2/org/slf4j/slf4j-parent/1.5.2/slf4j-parent-1.5.2.pom
[INFO] Downloaded from central: https://repo.maven.apache.org/maven2/org/slf4j/slf4j-parent/1.5.2/slf4j-parent-1.5.2.pom (7.6 kB at 1.5 MB/s)
[INFO] Downloading from wso2.releases: https://maven.wso2.org/nexus/content/repositories/releases/org/slf4j/slf4j-api/1.5.2/slf4j-api-1.5.2.pom
[INFO] Downloading from wso2-nexus: https://maven.wso2.org/nexus/content/groups/wso2-public/org/slf4j/slf4j-api/1.5.2/slf4j-api-1.5.2.pom
[INFO] Downloading from 3rd-party: https://maven.wso2.org/nexus/content/repositories/thirdparty/org/slf4j/slf4j-api/1.5.2/slf4j-api-1.5.2.pom
[INFO] Downloading from shibboleth.internet2.edu: https://build.shibboleth.net/nexus/content/groups/public/org/slf4j/slf4j-api/1.5.2/slf4j-api-1.5.2.pom
[INFO] Downloading from shibboleth-release: https://build.shibboleth.net/nexus/content/groups/public/org/slf4j/slf4j-api/1.5.2/slf4j-api-1.5.2.pom
[INFO] Downloading from central: https://repo.maven.apache.org/maven2/org/slf4j/slf4j-api/1.5.2/slf4j-api-1.5.2.pom
[INFO] Downloaded from central: https://repo.maven.apache.org/maven2/org/slf4j/slf4j-api/1.5.2/slf4j-api-1.5.2.pom (3.0 kB at 746 kB/s)
[INFO] Downloading from wso2.releases: https://maven.wso2.org/nexus/content/repositories/releases/bouncycastle/bcprov-jdk14/140/bcprov-jdk14-140.pom
[INFO] Downloading from wso2-nexus: https://maven.wso2.org/nexus/content/groups/wso2-public/bouncycastle/bcprov-jdk14/140/bcprov-jdk14-140.pom
[INFO] Downloading from 3rd-party: https://maven.wso2.org/nexus/content/repositories/thirdparty/bouncycastle/bcprov-jdk14/140/bcprov-jdk14-140.pom
[INFO] Downloading from shibboleth.internet2.edu: https://build.shibboleth.net/nexus/content/groups/public/bouncycastle/bcprov-jdk14/140/bcprov-jdk14-140.pom
[INFO] Downloading from shibboleth-release: https://build.shibboleth.net/nexus/content/groups/public/bouncycastle/bcprov-jdk14/140/bcprov-jdk14-140.pom
[INFO] Downloading from central: https://repo.maven.apache.org/maven2/bouncycastle/bcprov-jdk14/140/bcprov-jdk14-140.pom
[INFO] Downloaded from central: https://repo.maven.apache.org/maven2/bouncycastle/bcprov-jdk14/140/bcprov-jdk14-140.pom (1.0 kB at 206 kB/s)
[INFO] Downloading from wso2.releases: https://maven.wso2.org/nexus/content/repositories/releases/org/apache/rampart/wso2/rampart-core/1.6.1.wso2v19/rampart-core-1.6.1.wso2v19.pom
[INFO] Downloading from wso2-nexus: https://maven.wso2.org/nexus/content/groups/wso2-public/org/apache/rampart/wso2/rampart-core/1.6.1.wso2v19/rampart-core-1.6.1.wso2v19.pom
[INFO] Downloading from 3rd-party: https://maven.wso2.org/nexus/content/repositories/thirdparty/org/apache/rampart/wso2/rampart-core/1.6.1.wso2v19/rampart-core-1.6.1.wso2v19.pom
[INFO] Downloading from shibboleth.internet2.edu: https://build.shibboleth.net/nexus/content/groups/public/org/apache/rampart/wso2/rampart-core/1.6.1.wso2v19/rampart-core-1.6.1.wso2v19.pom
[INFO] Downloading from shibboleth-release: https://build.shibboleth.net/nexus/content/groups/public/org/apache/rampart/wso2/rampart-core/1.6.1.wso2v19/rampart-core-1.6.1.wso2v19.pom
[INFO] Downloading from central: https://repo.maven.apache.org/maven2/org/apache/rampart/wso2/rampart-core/1.6.1.wso2v19/rampart-core-1.6.1.wso2v19.pom
[INFO] ------------------------------------------------------------------------
[INFO] Reactor Summary:
[INFO] 
[INFO] WSO2 Identity Server Apps - Parent 1.0.515-SNAPSHOT  SUCCESS [07:28 min]
[INFO] WSO2 Identity Server Apps - My Account ............. SUCCESS [01:45 min]
[INFO] WSO2 Identity Server Apps - Console ................ SUCCESS [  2.867 s]
[INFO] WSO2 Identity Server Apps - Authentication Portal .. SUCCESS [08:54 min]
[INFO] WSO2 Identity Server Apps - Recovery Portal ........ FAILURE [11:04 min]
[INFO] WSO2 Identity Server Apps - Email OTP Authentication Portal SKIPPED
[INFO] WSO2 Identity Server Apps - SMS OTP Authentication Portal SKIPPED
[INFO] WSO2 Identity Server Apps - TOTP Authentication Portal SKIPPED
[INFO] WSO2 Identity Server Apps - X509 Certificate Authentication Portal SKIPPED
[INFO] WSO2 Identity Server Apps - Theme Component ........ SKIPPED
[INFO] WSO2 Identity Server Apps - Portal Common Component  SKIPPED
[INFO] WSO2 Identity Server Apps - Cypress Integration Tests SKIPPED
[INFO] WSO2 Identity Server Apps - Common Server Feature .. SKIPPED
[INFO] WSO2 Identity Server Apps - My Account Server Feature SKIPPED
[INFO] WSO2 Identity Server Apps - Console Server Feature . SKIPPED
[INFO] WSO2 Identity Server Apps - Authentication Portal Server Feature SKIPPED
[INFO] WSO2 Identity Server Apps - Recovery Portal Server Feature SKIPPED
[INFO] WSO2 Identity Server Apps - Portal Aggregate Feature 1.0.515-SNAPSHOT SKIPPED
[INFO] ------------------------------------------------------------------------
[INFO] BUILD FAILURE
[INFO] ------------------------------------------------------------------------
[INFO] Total time: 30:42 min
[INFO] Finished at: 2020-11-05T14:01:29Z
[INFO] ------------------------------------------------------------------------
Waiting for Jenkins to finish collecting data
[ERROR] Failed to execute goal on project recovery-portal: Could not resolve dependencies for project org.wso2.identity.apps:recovery-portal:war:1.0.515-SNAPSHOT: Failed to collect dependencies at org.wso2.carbon.identity.governance:org.wso2.carbon.identity.recovery:jar:1.4.16 -> org.wso2.carbon.identity.event.handler.accountlock:org.wso2.carbon.identity.handler.event.account.lock:jar:1.1.12 -> org.wso2.carbon.identity.governance:org.wso2.carbon.identity.governance:jar:1.0.0 -> org.wso2.carbon.multitenancy:org.wso2.carbon.tenant.mgt:jar:4.6.0 -> org.apache.rampart.wso2:rampart-core:jar:1.6.1.wso2v19: Failed to read artifact descriptor for org.apache.rampart.wso2:rampart-core:jar:1.6.1.wso2v19: Could not transfer artifact org.apache.rampart.wso2:rampart-core:pom:1.6.1.wso2v19 from/to wso2.releases (https://maven.wso2.org/nexus/content/repositories/releases/): Failed to transfer file: https://maven.wso2.org/nexus/content/repositories/releases/org/apache/rampart/wso2/rampart-core/1.6.1.wso2v19/rampart-core-1.6.1.wso2v19.pom. Return code is: 502 , ReasonPhrase:Bad Gateway. -> [Help 1]
[ERROR] 
[ERROR] To see the full stack trace of the errors, re-run Maven with the -e switch.
[ERROR] Re-run Maven using the -X switch to enable full debug logging.
[ERROR] 
[ERROR] For more information about the errors and possible solutions, please read the following articles:
[ERROR] [Help 1] http://cwiki.apache.org/confluence/display/MAVEN/DependencyResolutionException
[ERROR] 
[ERROR] After correcting the problems, you can resume the build with the command
[ERROR]   mvn <goals> -rf :recovery-portal
[JENKINS] Archiving <https://wso2.org/jenkins/job/platform-builds/job/identity-apps/ws/apps/authentication-portal/pom.xml> to org.wso2.identity.apps/authentication-portal/1.0.515-SNAPSHOT/authentication-portal-1.0.515-SNAPSHOT.pom
[JENKINS] Archiving <https://wso2.org/jenkins/job/platform-builds/job/identity-apps/ws/apps/authentication-portal/target/authenticationendpoint.war> to org.wso2.identity.apps/authentication-portal/1.0.515-SNAPSHOT/authentication-portal-1.0.515-SNAPSHOT.war
[JENKINS] Archiving <https://wso2.org/jenkins/job/platform-builds/job/identity-apps/ws/features/org.wso2.identity.apps.recovery.portal.server.feature/pom.xml> to org.wso2.identity.apps/org.wso2.identity.apps.recovery.portal.server.feature/1.0.515-SNAPSHOT/org.wso2.identity.apps.recovery.portal.server.feature-1.0.515-SNAPSHOT.pom
[JENKINS] Archiving <https://wso2.org/jenkins/job/platform-builds/job/identity-apps/ws/apps/console/pom.xml> to org.wso2.identity.apps/console/1.0.515-SNAPSHOT/console-1.0.515-SNAPSHOT.pom
[JENKINS] Archiving <https://wso2.org/jenkins/job/platform-builds/job/identity-apps/ws/apps/console/target/identity-console-v1.0.515-SNAPSHOT.war> to org.wso2.identity.apps/console/1.0.515-SNAPSHOT/console-1.0.515-SNAPSHOT.war
[JENKINS] Archiving <https://wso2.org/jenkins/job/platform-builds/job/identity-apps/ws/apps/sms-otp-authentication-portal/pom.xml> to org.wso2.identity.apps/sms-otp-authentication-portal/1.0.515-SNAPSHOT/sms-otp-authentication-portal-1.0.515-SNAPSHOT.pom
[JENKINS] Archiving <https://wso2.org/jenkins/job/platform-builds/job/identity-apps/ws/tests/pom.xml> to org.wso2.identity.apps/identity-apps-cypress-tests/1.0.515-SNAPSHOT/identity-apps-cypress-tests-1.0.515-SNAPSHOT.pom
[JENKINS] Archiving <https://wso2.org/jenkins/job/platform-builds/job/identity-apps/ws/features/org.wso2.identity.apps.common.server.feature/pom.xml> to org.wso2.identity.apps/org.wso2.identity.apps.common.server.feature/1.0.515-SNAPSHOT/org.wso2.identity.apps.common.server.feature-1.0.515-SNAPSHOT.pom
[JENKINS] Archiving <https://wso2.org/jenkins/job/platform-builds/job/identity-apps/ws/apps/recovery-portal/pom.xml> to org.wso2.identity.apps/recovery-portal/1.0.515-SNAPSHOT/recovery-portal-1.0.515-SNAPSHOT.pom
[JENKINS] Archiving <https://wso2.org/jenkins/job/platform-builds/job/identity-apps/ws/components/theme/pom.xml> to org.wso2.identity.apps/identity-theme/1.0.515-SNAPSHOT/identity-theme-1.0.515-SNAPSHOT.pom
[JENKINS] Archiving <https://wso2.org/jenkins/job/platform-builds/job/identity-apps/ws/apps/email-otp-authentication-portal/pom.xml> to org.wso2.identity.apps/email-otp-authentication-portal/1.0.515-SNAPSHOT/email-otp-authentication-portal-1.0.515-SNAPSHOT.pom
[JENKINS] Archiving <https://wso2.org/jenkins/job/platform-builds/job/identity-apps/ws/apps/totp-authentication-portal/pom.xml> to org.wso2.identity.apps/totp-authentication-portal/1.0.515-SNAPSHOT/totp-authentication-portal-1.0.515-SNAPSHOT.pom
[JENKINS] Archiving <https://wso2.org/jenkins/job/platform-builds/job/identity-apps/ws/components/org.wso2.identity.apps.common/pom.xml> to org.wso2.identity.apps/org.wso2.identity.apps.common/1.0.515-SNAPSHOT/org.wso2.identity.apps.common-1.0.515-SNAPSHOT.pom
[JENKINS] Archiving <https://wso2.org/jenkins/job/platform-builds/job/identity-apps/ws/features/org.wso2.identity.apps.authentication.portal.server.feature/pom.xml> to org.wso2.identity.apps/org.wso2.identity.apps.authentication.portal.server.feature/1.0.515-SNAPSHOT/org.wso2.identity.apps.authentication.portal.server.feature-1.0.515-SNAPSHOT.pom
[JENKINS] Archiving <https://wso2.org/jenkins/job/platform-builds/job/identity-apps/ws/features/org.wso2.identity.apps.feature/pom.xml> to org.wso2.identity.apps/org.wso2.identity.apps.feature/1.0.515-SNAPSHOT/org.wso2.identity.apps.feature-1.0.515-SNAPSHOT.pom
[JENKINS] Archiving <https://wso2.org/jenkins/job/platform-builds/job/identity-apps/ws/features/org.wso2.identity.apps.console.server.feature/pom.xml> to org.wso2.identity.apps/org.wso2.identity.apps.console.server.feature/1.0.515-SNAPSHOT/org.wso2.identity.apps.console.server.feature-1.0.515-SNAPSHOT.pom
[JENKINS] Archiving <https://wso2.org/jenkins/job/platform-builds/job/identity-apps/ws/apps/myaccount/pom.xml> to org.wso2.identity.apps/myaccount/1.0.515-SNAPSHOT/myaccount-1.0.515-SNAPSHOT.pom
[JENKINS] Archiving <https://wso2.org/jenkins/job/platform-builds/job/identity-apps/ws/apps/myaccount/target/identity-myaccount-v1.0.515-SNAPSHOT.war> to org.wso2.identity.apps/myaccount/1.0.515-SNAPSHOT/myaccount-1.0.515-SNAPSHOT.war
[JENKINS] Archiving <https://wso2.org/jenkins/job/platform-builds/job/identity-apps/ws/apps/x509-certificate-authentication-portal/pom.xml> to org.wso2.identity.apps/x509-certificate-authentication-portal/1.0.515-SNAPSHOT/x509-certificate-authentication-portal-1.0.515-SNAPSHOT.pom
[JENKINS] Archiving <https://wso2.org/jenkins/job/platform-builds/job/identity-apps/ws/features/org.wso2.identity.apps.myaccount.server.feature/pom.xml> to org.wso2.identity.apps/org.wso2.identity.apps.myaccount.server.feature/1.0.515-SNAPSHOT/org.wso2.identity.apps.myaccount.server.feature-1.0.515-SNAPSHOT.pom
[JENKINS] Archiving <https://wso2.org/jenkins/job/platform-builds/job/identity-apps/ws/pom.xml> to org.wso2.identity.apps/identity-apps/1.0.515-SNAPSHOT/identity-apps-1.0.515-SNAPSHOT.pom
No mail will be sent out, as 'platform-builds » identity-apps » WSO2 Identity Server Apps - Authentication Portal #1449' does not have a result yet. Please make sure you set a proper result in case of pipeline/build scripts.
No mail will be sent out, as 'platform-builds » identity-apps » WSO2 Identity Server Apps - Recovery Portal Server Feature #1449' does not have a result yet. Please make sure you set a proper result in case of pipeline/build scripts.
No mail will be sent out, as 'platform-builds » identity-apps » WSO2 Identity Server Apps - Console #1449' does not have a result yet. Please make sure you set a proper result in case of pipeline/build scripts.
No mail will be sent out, as 'platform-builds » identity-apps » WSO2 Identity Server Apps - SMS OTP Authentication Portal #1449' does not have a result yet. Please make sure you set a proper result in case of pipeline/build scripts.
No mail will be sent out, as 'platform-builds » identity-apps » WSO2 Identity Server Apps - Cypress Integration Tests #1449' does not have a result yet. Please make sure you set a proper result in case of pipeline/build scripts.
No mail will be sent out, as 'platform-builds » identity-apps » WSO2 Identity Server Apps - Common Server Feature #1449' does not have a result yet. Please make sure you set a proper result in case of pipeline/build scripts.
Not sending mail to unregistered user jenkins-bot at wso2.com
Sending e-mails to: builder at wso2.org
No mail will be sent out, as 'platform-builds » identity-apps » WSO2 Identity Server Apps - Theme Component #1449' does not have a result yet. Please make sure you set a proper result in case of pipeline/build scripts.
No mail will be sent out, as 'platform-builds » identity-apps » WSO2 Identity Server Apps - Email OTP Authentication Portal #1449' does not have a result yet. Please make sure you set a proper result in case of pipeline/build scripts.
No mail will be sent out, as 'platform-builds » identity-apps » WSO2 Identity Server Apps - TOTP Authentication Portal #1449' does not have a result yet. Please make sure you set a proper result in case of pipeline/build scripts.
No mail will be sent out, as 'platform-builds » identity-apps » WSO2 Identity Server Apps - Portal Common Component #1449' does not have a result yet. Please make sure you set a proper result in case of pipeline/build scripts.
No mail will be sent out, as 'platform-builds » identity-apps » WSO2 Identity Server Apps - Authentication Portal Server Feature #1449' does not have a result yet. Please make sure you set a proper result in case of pipeline/build scripts.
No mail will be sent out, as 'platform-builds » identity-apps » WSO2 Identity Server Apps - Portal Aggregate Feature #1449' does not have a result yet. Please make sure you set a proper result in case of pipeline/build scripts.
No mail will be sent out, as 'platform-builds » identity-apps » WSO2 Identity Server Apps - Console Server Feature #1449' does not have a result yet. Please make sure you set a proper result in case of pipeline/build scripts.
No mail will be sent out, as 'platform-builds » identity-apps » WSO2 Identity Server Apps - My Account #1449' does not have a result yet. Please make sure you set a proper result in case of pipeline/build scripts.
No mail will be sent out, as 'platform-builds » identity-apps » WSO2 Identity Server Apps - X509 Certificate Authentication Portal #1449' does not have a result yet. Please make sure you set a proper result in case of pipeline/build scripts.
No mail will be sent out, as 'platform-builds » identity-apps » WSO2 Identity Server Apps - My Account Server Feature #1449' does not have a result yet. Please make sure you set a proper result in case of pipeline/build scripts.
No mail will be sent out, as 'platform-builds » identity-apps » WSO2 Identity Server Apps - Parent #1449' does not have a result yet. Please make sure you set a proper result in case of pipeline/build scripts.
channel stopped
[identity-apps] $ /usr/bin/env bash /tmp/jenkins8024887866538061126.sh
npm WARN @asgardio/oidc-js at 0.1.12 requires a peer of jsrsasign@^8.0.12 but none is installed. You must install peer dependencies yourself.
npm WARN @egoist/vue-to-react at 1.1.0 requires a peer of vue@^2.6.10 but none is installed. You must install peer dependencies yourself.
npm WARN @vue/compiler-sfc at 3.0.0 requires a peer of vue at 3.0.0 but none is installed. You must install peer dependencies yourself.
npm WARN htmlparser2 at 5.0.0 requires a peer of @types/node@^14.0.5 but none is installed. You must install peer dependencies yourself.
npm WARN jsdom at 16.4.0 requires a peer of canvas@^2.5.0 but none is installed. You must install peer dependencies yourself.
npm WARN react-password-strength-bar at 0.3.2 requires a peer of react at 16.8.6 but none is installed. You must install peer dependencies yourself.
npm WARN react-password-strength-bar at 0.3.2 requires a peer of react-dom at 16.8.6 but none is installed. You must install peer dependencies yourself.
npm WARN redux-form at 8.3.6 requires a peer of immutable@^3.8.2 || ^4.0.0 but none is installed. You must install peer dependencies yourself.
npm WARN ws at 7.3.1 requires a peer of bufferutil@^4.0.1 but none is installed. You must install peer dependencies yourself.
npm WARN ws at 7.3.1 requires a peer of utf-8-validate@^5.0.2 but none is installed. You must install peer dependencies yourself.
npm WARN optional SKIPPING OPTIONAL DEPENDENCY: fsevents at 2.1.3 (node_modules/@jest/core/node_modules/fsevents):
npm WARN notsup SKIPPING OPTIONAL DEPENDENCY: Unsupported platform for fsevents at 2.1.3: wanted {"os":"darwin","arch":"any"} (current: {"os":"linux","arch":"x64"})
npm WARN optional SKIPPING OPTIONAL DEPENDENCY: fsevents at 2.1.3 (node_modules/@jest/reporters/node_modules/fsevents):
npm WARN notsup SKIPPING OPTIONAL DEPENDENCY: Unsupported platform for fsevents at 2.1.3: wanted {"os":"darwin","arch":"any"} (current: {"os":"linux","arch":"x64"})
npm WARN optional SKIPPING OPTIONAL DEPENDENCY: fsevents at 2.1.3 (node_modules/@jest/test-sequencer/node_modules/fsevents):
npm WARN notsup SKIPPING OPTIONAL DEPENDENCY: Unsupported platform for fsevents at 2.1.3: wanted {"os":"darwin","arch":"any"} (current: {"os":"linux","arch":"x64"})
npm WARN optional SKIPPING OPTIONAL DEPENDENCY: fsevents at 2.1.3 (node_modules/chokidar/node_modules/fsevents):
npm WARN notsup SKIPPING OPTIONAL DEPENDENCY: Unsupported platform for fsevents at 2.1.3: wanted {"os":"darwin","arch":"any"} (current: {"os":"linux","arch":"x64"})
npm WARN optional SKIPPING OPTIONAL DEPENDENCY: fsevents at 2.1.3 (node_modules/babel-jest/node_modules/fsevents):
npm WARN notsup SKIPPING OPTIONAL DEPENDENCY: Unsupported platform for fsevents at 2.1.3: wanted {"os":"darwin","arch":"any"} (current: {"os":"linux","arch":"x64"})
npm WARN optional SKIPPING OPTIONAL DEPENDENCY: fsevents at 2.1.3 (node_modules/jest-runner/node_modules/fsevents):
npm WARN notsup SKIPPING OPTIONAL DEPENDENCY: Unsupported platform for fsevents at 2.1.3: wanted {"os":"darwin","arch":"any"} (current: {"os":"linux","arch":"x64"})
npm WARN optional SKIPPING OPTIONAL DEPENDENCY: fsevents at 1.2.13 (node_modules/fsevents):
npm WARN notsup SKIPPING OPTIONAL DEPENDENCY: Unsupported platform for fsevents at 1.2.13: wanted {"os":"darwin","arch":"any"} (current: {"os":"linux","arch":"x64"})
npm WARN optional SKIPPING OPTIONAL DEPENDENCY: fsevents at 2.1.3 (node_modules/jest-runtime/node_modules/fsevents):
npm WARN notsup SKIPPING OPTIONAL DEPENDENCY: Unsupported platform for fsevents at 2.1.3: wanted {"os":"darwin","arch":"any"} (current: {"os":"linux","arch":"x64"})
npm WARN optional SKIPPING OPTIONAL DEPENDENCY: fsevents at 2.1.3 (node_modules/jest-snapshot/node_modules/fsevents):
npm WARN notsup SKIPPING OPTIONAL DEPENDENCY: Unsupported platform for fsevents at 2.1.3: wanted {"os":"darwin","arch":"any"} (current: {"os":"linux","arch":"x64"})

audited 3382 packages in 17.8s
found 0 vulnerabilities


> @wso2is/webapps at 1.0.515 update-version <https://wso2.org/jenkins/job/platform-builds/job/identity-apps/ws/>
> node scripts/update-version.js "jenkins=true" "build=#1449" "pom=1.0.515"

lerna notice cli v3.22.1
lerna info ci enabled
lerna info current version 1.0.515
lerna notice FYI git repository validation has been skipped, please ensure your version bumps are correct
lerna WARN force-publish all packages
lerna info Assuming all packages changed
lerna WARN version Skipping working tree validation, proceed at your own risk
lerna info auto-confirmed 
lerna info execute Skipping git tag/commit
lerna info execute Skipping git push
lerna info execute Skipping releases
lerna success version finished
npm WARN @asgardio/oidc-js at 0.1.12 requires a peer of jsrsasign@^8.0.12 but none is installed. You must install peer dependencies yourself.
npm WARN @egoist/vue-to-react at 1.1.0 requires a peer of vue@^2.6.10 but none is installed. You must install peer dependencies yourself.
npm WARN @vue/compiler-sfc at 3.0.0 requires a peer of vue at 3.0.0 but none is installed. You must install peer dependencies yourself.
npm WARN htmlparser2 at 5.0.0 requires a peer of @types/node@^14.0.5 but none is installed. You must install peer dependencies yourself.
npm WARN jsdom at 16.4.0 requires a peer of canvas@^2.5.0 but none is installed. You must install peer dependencies yourself.
npm WARN react-password-strength-bar at 0.3.2 requires a peer of react at 16.8.6 but none is installed. You must install peer dependencies yourself.
npm WARN react-password-strength-bar at 0.3.2 requires a peer of react-dom at 16.8.6 but none is installed. You must install peer dependencies yourself.
npm WARN redux-form at 8.3.6 requires a peer of immutable@^3.8.2 || ^4.0.0 but none is installed. You must install peer dependencies yourself.
npm WARN ws at 7.3.1 requires a peer of bufferutil@^4.0.1 but none is installed. You must install peer dependencies yourself.
npm WARN ws at 7.3.1 requires a peer of utf-8-validate@^5.0.2 but none is installed. You must install peer dependencies yourself.
npm WARN optional SKIPPING OPTIONAL DEPENDENCY: fsevents at 2.1.3 (node_modules/@jest/core/node_modules/fsevents):
npm WARN notsup SKIPPING OPTIONAL DEPENDENCY: Unsupported platform for fsevents at 2.1.3: wanted {"os":"darwin","arch":"any"} (current: {"os":"linux","arch":"x64"})
npm WARN optional SKIPPING OPTIONAL DEPENDENCY: fsevents at 2.1.3 (node_modules/@jest/reporters/node_modules/fsevents):
npm WARN notsup SKIPPING OPTIONAL DEPENDENCY: Unsupported platform for fsevents at 2.1.3: wanted {"os":"darwin","arch":"any"} (current: {"os":"linux","arch":"x64"})
npm WARN optional SKIPPING OPTIONAL DEPENDENCY: fsevents at 2.1.3 (node_modules/babel-jest/node_modules/fsevents):
npm WARN notsup SKIPPING OPTIONAL DEPENDENCY: Unsupported platform for fsevents at 2.1.3: wanted {"os":"darwin","arch":"any"} (current: {"os":"linux","arch":"x64"})
npm WARN optional SKIPPING OPTIONAL DEPENDENCY: fsevents at 2.1.3 (node_modules/@jest/test-sequencer/node_modules/fsevents):
npm WARN notsup SKIPPING OPTIONAL DEPENDENCY: Unsupported platform for fsevents at 2.1.3: wanted {"os":"darwin","arch":"any"} (current: {"os":"linux","arch":"x64"})
npm WARN optional SKIPPING OPTIONAL DEPENDENCY: fsevents at 1.2.13 (node_modules/fsevents):
npm WARN notsup SKIPPING OPTIONAL DEPENDENCY: Unsupported platform for fsevents at 1.2.13: wanted {"os":"darwin","arch":"any"} (current: {"os":"linux","arch":"x64"})
npm WARN optional SKIPPING OPTIONAL DEPENDENCY: fsevents at 2.1.3 (node_modules/chokidar/node_modules/fsevents):
npm WARN notsup SKIPPING OPTIONAL DEPENDENCY: Unsupported platform for fsevents at 2.1.3: wanted {"os":"darwin","arch":"any"} (current: {"os":"linux","arch":"x64"})
npm WARN optional SKIPPING OPTIONAL DEPENDENCY: fsevents at 2.1.3 (node_modules/jest-runtime/node_modules/fsevents):
npm WARN notsup SKIPPING OPTIONAL DEPENDENCY: Unsupported platform for fsevents at 2.1.3: wanted {"os":"darwin","arch":"any"} (current: {"os":"linux","arch":"x64"})
npm WARN optional SKIPPING OPTIONAL DEPENDENCY: fsevents at 2.1.3 (node_modules/jest-snapshot/node_modules/fsevents):
npm WARN notsup SKIPPING OPTIONAL DEPENDENCY: Unsupported platform for fsevents at 2.1.3: wanted {"os":"darwin","arch":"any"} (current: {"os":"linux","arch":"x64"})
npm WARN optional SKIPPING OPTIONAL DEPENDENCY: fsevents at 2.1.3 (node_modules/jest-runner/node_modules/fsevents):
npm WARN notsup SKIPPING OPTIONAL DEPENDENCY: Unsupported platform for fsevents at 2.1.3: wanted {"os":"darwin","arch":"any"} (current: {"os":"linux","arch":"x64"})

lerna info update packages version to 1.0.515
git info start staging version updated files
git success stage version updated files
Not sending mail to unregistered user jenkins-bot at wso2.com


More information about the Builder mailing list