[Builder] Build failed in Jenkins: forked-dependencies » andes_3.2.x #1631

cbuilder at wso2.org cbuilder at wso2.org
Thu Dec 2 12:21:18 PST 2021


See <https://wso2.org/jenkins/job/forked-dependencies/job/andes_3.2.x/1631/display/redirect>

Changes:


------------------------------------------
[...truncated 740.83 KB...]
[INFO] 
[INFO] --- maven-resources-plugin:2.7:testResources (default-testResources) @ andes-client ---
[INFO] Using 'UTF-8' encoding to copy filtered resources.
[INFO] skip non existing resourceDirectory <https://wso2.org/jenkins/job/forked-dependencies/job/andes_3.2.x/ws/modules/orbit/andes-client/src/test/resources>
[INFO] Copying 3 resources
[INFO] 
[INFO] --- maven-compiler-plugin:2.3.2:testCompile (default-testCompile) @ andes-client ---
[INFO] No sources to compile
[INFO] 
[INFO] --- maven-surefire-plugin:2.4.3:test (default-test) @ andes-client ---
[INFO] Downloading from repository.dev.java.net-maven2: http://download.java.net/maven/2/org/apache/maven/surefire/surefire-junit4/2.4.3/surefire-junit4-2.4.3.pom
[INFO] Downloading from wso2.releases: http://maven.wso2.org/nexus/content/repositories/releases/org/apache/maven/surefire/surefire-junit4/2.4.3/surefire-junit4-2.4.3.pom
[INFO] Downloading from central: https://repo.maven.apache.org/maven2/org/apache/maven/surefire/surefire-junit4/2.4.3/surefire-junit4-2.4.3.pom
[INFO] Downloaded from central: https://repo.maven.apache.org/maven2/org/apache/maven/surefire/surefire-junit4/2.4.3/surefire-junit4-2.4.3.pom (2.0 kB at 164 kB/s)
[INFO] Downloading from repository.dev.java.net-maven2: http://download.java.net/maven/2/junit/junit/4.0/junit-4.0.pom
[INFO] Downloading from wso2.releases: http://maven.wso2.org/nexus/content/repositories/releases/junit/junit/4.0/junit-4.0.pom
[INFO] Downloading from central: https://repo.maven.apache.org/maven2/junit/junit/4.0/junit-4.0.pom
[INFO] Downloaded from central: https://repo.maven.apache.org/maven2/junit/junit/4.0/junit-4.0.pom (210 B at 30 kB/s)
[INFO] Downloading from repository.dev.java.net-maven2: http://download.java.net/maven/2/junit/junit/4.0/junit-4.0.jar
[INFO] Downloading from repository.dev.java.net-maven2: http://download.java.net/maven/2/org/apache/maven/surefire/surefire-junit4/2.4.3/surefire-junit4-2.4.3.jar
[INFO] Downloading from wso2.releases: http://maven.wso2.org/nexus/content/repositories/releases/org/apache/maven/surefire/surefire-junit4/2.4.3/surefire-junit4-2.4.3.jar
[INFO] Downloading from central: https://repo.maven.apache.org/maven2/org/apache/maven/surefire/surefire-junit4/2.4.3/surefire-junit4-2.4.3.jar
[INFO] Downloaded from central: https://repo.maven.apache.org/maven2/org/apache/maven/surefire/surefire-junit4/2.4.3/surefire-junit4-2.4.3.jar (12 kB at 550 kB/s)
[INFO] Downloading from wso2.releases: http://maven.wso2.org/nexus/content/repositories/releases/junit/junit/4.0/junit-4.0.jar
[INFO] Downloading from central: https://repo.maven.apache.org/maven2/junit/junit/4.0/junit-4.0.jar
[INFO] Downloaded from central: https://repo.maven.apache.org/maven2/junit/junit/4.0/junit-4.0.jar (106 kB at 7.5 MB/s)
[INFO] Surefire report directory: <https://wso2.org/jenkins/job/forked-dependencies/job/andes_3.2.x/ws/modules/orbit/andes-client/target/surefire-reports>

-------------------------------------------------------
 T E S T S
-------------------------------------------------------
There are no tests to run.

Results :

Tests run: 0, Failures: 0, Errors: 0, Skipped: 0

[JENKINS] Recording test results[INFO] 

[INFO] --- maven-bundle-plugin:2.3.7:bundle (default-bundle) @ andes-client ---
[INFO] 
[INFO] >>> maven-source-plugin:2.2:jar (attach-sources) > generate-sources @ andes-client >>>
[WARNING] Failed to getClass for org.apache.maven.plugin.source.SourceJarMojo
[INFO] 
[INFO] <<< maven-source-plugin:2.2:jar (attach-sources) < generate-sources @ andes-client <<<
[INFO] 
[INFO] 
[INFO] --- maven-source-plugin:2.2:jar (attach-sources) @ andes-client ---
[INFO] Building jar: <https://wso2.org/jenkins/job/forked-dependencies/job/andes_3.2.x/ws/modules/orbit/andes-client/target/andes-client-3.2.19-sources.jar>
[INFO] 
[INFO] >>> maven-javadoc-plugin:2.1:jar (attach-javadocs) > generate-sources @ andes-client >>>
[WARNING] Failed to getClass for org.apache.maven.plugin.javadoc.JavadocJar
[INFO] 
[INFO] <<< maven-javadoc-plugin:2.1:jar (attach-javadocs) < generate-sources @ andes-client <<<
[INFO] 
[INFO] 
[INFO] --- maven-javadoc-plugin:2.1:jar (attach-javadocs) @ andes-client ---
Loading source files for package org.wso2.andes.wso2.jndi...
Constructing Javadoc information...
Standard Doclet version 1.8.0_171
Building tree for all the packages and classes...
Generating <https://wso2.org/jenkins/job/forked-dependencies/job/andes_3.2.x/ws/modules/orbit/andes-client/target/apidocs/org/wso2/andes/wso2/jndi/TenantAwareInitialContextFactory.html...>
Generating <https://wso2.org/jenkins/job/forked-dependencies/job/andes_3.2.x/ws/modules/orbit/andes-client/target/apidocs/org/wso2/andes/wso2/jndi/package-frame.html...>
Generating <https://wso2.org/jenkins/job/forked-dependencies/job/andes_3.2.x/ws/modules/orbit/andes-client/target/apidocs/org/wso2/andes/wso2/jndi/package-summary.html...>
Generating <https://wso2.org/jenkins/job/forked-dependencies/job/andes_3.2.x/ws/modules/orbit/andes-client/target/apidocs/org/wso2/andes/wso2/jndi/package-tree.html...>
Generating <https://wso2.org/jenkins/job/forked-dependencies/job/andes_3.2.x/ws/modules/orbit/andes-client/target/apidocs/constant-values.html...>
Generating <https://wso2.org/jenkins/job/forked-dependencies/job/andes_3.2.x/ws/modules/orbit/andes-client/target/apidocs/org/wso2/andes/wso2/jndi/class-use/TenantAwareInitialContextFactory.html...>
Generating <https://wso2.org/jenkins/job/forked-dependencies/job/andes_3.2.x/ws/modules/orbit/andes-client/target/apidocs/org/wso2/andes/wso2/jndi/package-use.html...>
Building index for all the packages and classes...
Generating <https://wso2.org/jenkins/job/forked-dependencies/job/andes_3.2.x/ws/modules/orbit/andes-client/target/apidocs/overview-tree.html...>
Generating <https://wso2.org/jenkins/job/forked-dependencies/job/andes_3.2.x/ws/modules/orbit/andes-client/target/apidocs/index-all.html...>
Generating <https://wso2.org/jenkins/job/forked-dependencies/job/andes_3.2.x/ws/modules/orbit/andes-client/target/apidocs/deprecated-list.html...>
Building index for all classes...
Generating <https://wso2.org/jenkins/job/forked-dependencies/job/andes_3.2.x/ws/modules/orbit/andes-client/target/apidocs/allclasses-frame.html...>
Generating <https://wso2.org/jenkins/job/forked-dependencies/job/andes_3.2.x/ws/modules/orbit/andes-client/target/apidocs/allclasses-noframe.html...>
Generating <https://wso2.org/jenkins/job/forked-dependencies/job/andes_3.2.x/ws/modules/orbit/andes-client/target/apidocs/index.html...>
Generating <https://wso2.org/jenkins/job/forked-dependencies/job/andes_3.2.x/ws/modules/orbit/andes-client/target/apidocs/help-doc.html...>
[INFO] Building jar: <https://wso2.org/jenkins/job/forked-dependencies/job/andes_3.2.x/ws/modules/orbit/andes-client/target/andes-client-3.2.19-javadoc.jar>
[INFO] 
[INFO] --- maven-install-plugin:2.5.2:install (default-install) @ andes-client ---
[INFO] Installing <https://wso2.org/jenkins/job/forked-dependencies/job/andes_3.2.x/ws/modules/orbit/andes-client/target/andes-client-3.2.19.jar> to <https://wso2.org/jenkins/job/forked-dependencies/job/andes_3.2.x/ws/.repository/org/wso2/andes/wso2/andes-client/3.2.19/andes-client-3.2.19.jar>
[INFO] Installing <https://wso2.org/jenkins/job/forked-dependencies/job/andes_3.2.x/ws/modules/orbit/andes-client/pom.xml> to <https://wso2.org/jenkins/job/forked-dependencies/job/andes_3.2.x/ws/.repository/org/wso2/andes/wso2/andes-client/3.2.19/andes-client-3.2.19.pom>
[INFO] Installing <https://wso2.org/jenkins/job/forked-dependencies/job/andes_3.2.x/ws/modules/orbit/andes-client/target/andes-client-3.2.19-sources.jar> to <https://wso2.org/jenkins/job/forked-dependencies/job/andes_3.2.x/ws/.repository/org/wso2/andes/wso2/andes-client/3.2.19/andes-client-3.2.19-sources.jar>
[INFO] Installing <https://wso2.org/jenkins/job/forked-dependencies/job/andes_3.2.x/ws/modules/orbit/andes-client/target/andes-client-3.2.19-javadoc.jar> to <https://wso2.org/jenkins/job/forked-dependencies/job/andes_3.2.x/ws/.repository/org/wso2/andes/wso2/andes-client/3.2.19/andes-client-3.2.19-javadoc.jar>
[INFO] 
[INFO] --- maven-bundle-plugin:2.3.7:install (default-install) @ andes-client ---
[INFO] Installing org/wso2/andes/wso2/andes-client/3.2.19/andes-client-3.2.19.jar
[INFO] Writing OBR metadata
[INFO] ------------------------------------------------------------------------
[INFO] Reactor Summary for Andes 3.2.19:
[INFO] 
[INFO] Andes .............................................. SUCCESS [03:43 min]
[INFO] WSO2 Carbon - Dependencies - Andes ................. SUCCESS [04:18 min]
[INFO] WSO2 Carbon - Orbit - andes ........................ SUCCESS [ 49.818 s]
[INFO] andes.wso2 ......................................... SUCCESS [ 11.358 s]
[INFO] ------------------------------------------------------------------------
[INFO] BUILD SUCCESS
[INFO] ------------------------------------------------------------------------
[INFO] Total time:  11:16 min
[INFO] Finished at: 2021-12-02T20:08:12Z
[INFO] ------------------------------------------------------------------------
Waiting for Jenkins to finish collecting data
[JENKINS] Archiving <https://wso2.org/jenkins/job/forked-dependencies/job/andes_3.2.x/ws/modules/orbit/andes/pom.xml> to org.wso2.andes.wso2/andes/3.2.19/andes-3.2.19.pom
[JENKINS] Archiving <https://wso2.org/jenkins/job/forked-dependencies/job/andes_3.2.x/ws/modules/orbit/andes/target/andes-3.2.19.jar> to org.wso2.andes.wso2/andes/3.2.19/andes-3.2.19.jar
[JENKINS] Archiving <https://wso2.org/jenkins/job/forked-dependencies/job/andes_3.2.x/ws/modules/orbit/andes/target/andes-3.2.19-sources.jar> to org.wso2.andes.wso2/andes/3.2.19/andes-3.2.19-sources.jar
[JENKINS] Archiving <https://wso2.org/jenkins/job/forked-dependencies/job/andes_3.2.x/ws/modules/orbit/andes/target/andes-3.2.19-javadoc.jar> to org.wso2.andes.wso2/andes/3.2.19/andes-3.2.19-javadoc.jar
[JENKINS] Archiving <https://wso2.org/jenkins/job/forked-dependencies/job/andes_3.2.x/ws/modules/orbit/andes-client/pom.xml> to org.wso2.andes.wso2/andes-client/3.2.19/andes-client-3.2.19.pom
[JENKINS] Archiving <https://wso2.org/jenkins/job/forked-dependencies/job/andes_3.2.x/ws/modules/orbit/andes-client/target/andes-client-3.2.19.jar> to org.wso2.andes.wso2/andes-client/3.2.19/andes-client-3.2.19.jar
[JENKINS] Archiving <https://wso2.org/jenkins/job/forked-dependencies/job/andes_3.2.x/ws/modules/orbit/andes-client/target/andes-client-3.2.19-sources.jar> to org.wso2.andes.wso2/andes-client/3.2.19/andes-client-3.2.19-sources.jar
[JENKINS] Archiving <https://wso2.org/jenkins/job/forked-dependencies/job/andes_3.2.x/ws/modules/orbit/andes-client/target/andes-client-3.2.19-javadoc.jar> to org.wso2.andes.wso2/andes-client/3.2.19/andes-client-3.2.19-javadoc.jar
[JENKINS] Archiving <https://wso2.org/jenkins/job/forked-dependencies/job/andes_3.2.x/ws/pom.xml> to org.wso2.andes/andes-parent/3.2.19/andes-parent-3.2.19.pom
[JENKINS] Archiving <https://wso2.org/jenkins/job/forked-dependencies/job/andes_3.2.x/ws/modules/andes-core/pom.xml> to org.wso2.andes/andes/3.2.19/andes-3.2.19.pom
No mail will be sent out, as 'forked-dependencies » andes_3.2.x » WSO2 Carbon - Orbit - andes #1631' does not have a result yet. Please make sure you set a proper result in case of pipeline/build scripts.
No mail will be sent out, as 'forked-dependencies » andes_3.2.x » andes.wso2 #1631' does not have a result yet. Please make sure you set a proper result in case of pipeline/build scripts.
No mail will be sent out, as 'forked-dependencies » andes_3.2.x » Andes #1631' does not have a result yet. Please make sure you set a proper result in case of pipeline/build scripts.
No mail will be sent out, as 'forked-dependencies » andes_3.2.x » WSO2 Carbon - Dependencies - Andes #1631' does not have a result yet. Please make sure you set a proper result in case of pipeline/build scripts.
channel stopped
[JaCoCo plugin] Collecting JaCoCo coverage data...
[JaCoCo plugin] **/**.exec;**/classes;**/java; locations are configured
[JaCoCo plugin] Number of found exec files for pattern **/**.exec: 0
[JaCoCo plugin] Saving matched execfiles:  
[JaCoCo plugin] Saving matched class directories for class-pattern: **/classes: 
[JaCoCo plugin]  - <https://wso2.org/jenkins/job/forked-dependencies/job/andes_3.2.x/ws/modules/andes-core/build/scratch/broker-plugins/access-control/classes> 17 files
[JaCoCo plugin]  - <https://wso2.org/jenkins/job/forked-dependencies/job/andes_3.2.x/ws/modules/andes-core/build/scratch/broker-plugins/access-control/test/classes> 5 files
[JaCoCo plugin]  - <https://wso2.org/jenkins/job/forked-dependencies/job/andes_3.2.x/ws/modules/andes-core/build/scratch/broker-plugins/experimental/info/classes> 12 files
[JaCoCo plugin]  - <https://wso2.org/jenkins/job/forked-dependencies/job/andes_3.2.x/ws/modules/andes-core/build/scratch/broker-plugins/experimental/info/test/classes> 13 files
[JaCoCo plugin]  - <https://wso2.org/jenkins/job/forked-dependencies/job/andes_3.2.x/ws/modules/andes-core/build/scratch/broker-plugins/experimental/shutdown/classes> 4 files
[JaCoCo plugin]  - <https://wso2.org/jenkins/job/forked-dependencies/job/andes_3.2.x/ws/modules/andes-core/build/scratch/broker-plugins/experimental/shutdown/test/classes> 0 files
[JaCoCo plugin]  - <https://wso2.org/jenkins/job/forked-dependencies/job/andes_3.2.x/ws/modules/andes-core/build/scratch/broker-plugins/extras/classes> 7 files
[JaCoCo plugin]  - <https://wso2.org/jenkins/job/forked-dependencies/job/andes_3.2.x/ws/modules/andes-core/build/scratch/broker-plugins/extras/test/classes> 1 files
[JaCoCo plugin]  - <https://wso2.org/jenkins/job/forked-dependencies/job/andes_3.2.x/ws/modules/andes-core/build/scratch/broker-plugins/firewall/classes> 8 files
[JaCoCo plugin]  - <https://wso2.org/jenkins/job/forked-dependencies/job/andes_3.2.x/ws/modules/andes-core/build/scratch/broker-plugins/firewall/test/classes> 3 files
[JaCoCo plugin]  - <https://wso2.org/jenkins/job/forked-dependencies/job/andes_3.2.x/ws/modules/andes-core/build/scratch/broker/classes> 1933 files
[JaCoCo plugin]  - <https://wso2.org/jenkins/job/forked-dependencies/job/andes_3.2.x/ws/modules/andes-core/build/scratch/broker/test/classes> 205 files
[JaCoCo plugin]  - <https://wso2.org/jenkins/job/forked-dependencies/job/andes_3.2.x/ws/modules/andes-core/build/scratch/client/classes> 317 files
[JaCoCo plugin]  - <https://wso2.org/jenkins/job/forked-dependencies/job/andes_3.2.x/ws/modules/andes-core/build/scratch/client/example/classes> 34 files
[JaCoCo plugin]  - <https://wso2.org/jenkins/job/forked-dependencies/job/andes_3.2.x/ws/modules/andes-core/build/scratch/client/example/test/classes> 0 files
[JaCoCo plugin]  - <https://wso2.org/jenkins/job/forked-dependencies/job/andes_3.2.x/ws/modules/andes-core/build/scratch/client/test/classes> 31 files
[JaCoCo plugin]  - <https://wso2.org/jenkins/job/forked-dependencies/job/andes_3.2.x/ws/modules/andes-core/build/scratch/common/classes> 1177 files
[JaCoCo plugin]  - <https://wso2.org/jenkins/job/forked-dependencies/job/andes_3.2.x/ws/modules/andes-core/build/scratch/common/test/classes> 41 files
[JaCoCo plugin]  - <https://wso2.org/jenkins/job/forked-dependencies/job/andes_3.2.x/ws/modules/andes-core/build/scratch/integrationtests/classes> 19 files
[JaCoCo plugin]  - <https://wso2.org/jenkins/job/forked-dependencies/job/andes_3.2.x/ws/modules/andes-core/build/scratch/integrationtests/test/classes> 0 files
[JaCoCo plugin]  - <https://wso2.org/jenkins/job/forked-dependencies/job/andes_3.2.x/ws/modules/andes-core/build/scratch/junit-toolkit/classes> 56 files
[JaCoCo plugin]  - <https://wso2.org/jenkins/job/forked-dependencies/job/andes_3.2.x/ws/modules/andes-core/build/scratch/junit-toolkit/test/classes> 0 files
[JaCoCo plugin]  - <https://wso2.org/jenkins/job/forked-dependencies/job/andes_3.2.x/ws/modules/andes-core/build/scratch/management/common/classes> 28 files
[JaCoCo plugin]  - <https://wso2.org/jenkins/job/forked-dependencies/job/andes_3.2.x/ws/modules/andes-core/build/scratch/management/common/test/classes> 3 files
[JaCoCo plugin]  - <https://wso2.org/jenkins/job/forked-dependencies/job/andes_3.2.x/ws/modules/andes-core/build/scratch/management/eclipse-plugin/classes> 259 files
[JaCoCo plugin]  - <https://wso2.org/jenkins/job/forked-dependencies/job/andes_3.2.x/ws/modules/andes-core/build/scratch/management/eclipse-plugin/test/classes> 3 files
[JaCoCo plugin]  - <https://wso2.org/jenkins/job/forked-dependencies/job/andes_3.2.x/ws/modules/andes-core/build/scratch/management/example/classes> 3 files
[JaCoCo plugin]  - <https://wso2.org/jenkins/job/forked-dependencies/job/andes_3.2.x/ws/modules/andes-core/build/scratch/management/example/test/classes> 0 files
[JaCoCo plugin]  - <https://wso2.org/jenkins/job/forked-dependencies/job/andes_3.2.x/ws/modules/andes-core/build/scratch/perftests/classes> 41 files
[JaCoCo plugin]  - <https://wso2.org/jenkins/job/forked-dependencies/job/andes_3.2.x/ws/modules/andes-core/build/scratch/perftests/test/classes> 0 files
[JaCoCo plugin]  - <https://wso2.org/jenkins/job/forked-dependencies/job/andes_3.2.x/ws/modules/andes-core/build/scratch/systests/classes> 301 files
[JaCoCo plugin]  - <https://wso2.org/jenkins/job/forked-dependencies/job/andes_3.2.x/ws/modules/andes-core/build/scratch/systests/test/classes> 301 files
[JaCoCo plugin]  - <https://wso2.org/jenkins/job/forked-dependencies/job/andes_3.2.x/ws/modules/andes-core/build/scratch/testkit/classes> 1 files
[JaCoCo plugin]  - <https://wso2.org/jenkins/job/forked-dependencies/job/andes_3.2.x/ws/modules/andes-core/build/scratch/testkit/test/classes> 0 files
[JaCoCo plugin]  - <https://wso2.org/jenkins/job/forked-dependencies/job/andes_3.2.x/ws/modules/andes-core/build/scratch/tools/classes> 36 files
[JaCoCo plugin]  - <https://wso2.org/jenkins/job/forked-dependencies/job/andes_3.2.x/ws/modules/andes-core/build/scratch/tools/test/classes> 0 files
[JaCoCo plugin]  - <https://wso2.org/jenkins/job/forked-dependencies/job/andes_3.2.x/ws/modules/andes-core/tasks/classes> 7 files
[JaCoCo plugin]  - <https://wso2.org/jenkins/job/forked-dependencies/job/andes_3.2.x/ws/modules/orbit/andes-client/target/classes> 1 files
[JaCoCo plugin]  - <https://wso2.org/jenkins/job/forked-dependencies/job/andes_3.2.x/ws/modules/orbit/andes/target/classes> 3 files
[JaCoCo plugin] Saving matched source directories for source-pattern: **/java: 
[JaCoCo plugin] Source Inclusions: **/*.java
[JaCoCo plugin] Source Exclusions: 
[JaCoCo plugin] - <https://wso2.org/jenkins/job/forked-dependencies/job/andes_3.2.x/ws/.repository/net/java> 0 files
[JaCoCo plugin] - <https://wso2.org/jenkins/job/forked-dependencies/job/andes_3.2.x/ws/modules/andes-core/broker-plugins/access-control/src/main/java> 10 files
[JaCoCo plugin] - <https://wso2.org/jenkins/job/forked-dependencies/job/andes_3.2.x/ws/modules/andes-core/broker-plugins/access-control/src/test/java> 3 files
[JaCoCo plugin] - <https://wso2.org/jenkins/job/forked-dependencies/job/andes_3.2.x/ws/modules/andes-core/broker-plugins/experimental/info/src/main/java> 10 files
[JaCoCo plugin] - <https://wso2.org/jenkins/job/forked-dependencies/job/andes_3.2.x/ws/modules/andes-core/broker-plugins/experimental/info/src/test/java> 9 files
[JaCoCo plugin] - <https://wso2.org/jenkins/job/forked-dependencies/job/andes_3.2.x/ws/modules/andes-core/broker-plugins/experimental/shutdown/src/main/java> 3 files
[JaCoCo plugin] - <https://wso2.org/jenkins/job/forked-dependencies/job/andes_3.2.x/ws/modules/andes-core/broker-plugins/extras/src/main/java> 5 files
[JaCoCo plugin] - <https://wso2.org/jenkins/job/forked-dependencies/job/andes_3.2.x/ws/modules/andes-core/broker-plugins/extras/src/test/java> 1 files
[JaCoCo plugin] - <https://wso2.org/jenkins/job/forked-dependencies/job/andes_3.2.x/ws/modules/andes-core/broker-plugins/firewall/src/main/java> 5 files
[JaCoCo plugin] - <https://wso2.org/jenkins/job/forked-dependencies/job/andes_3.2.x/ws/modules/andes-core/broker-plugins/firewall/src/test/java> 2 files
[JaCoCo plugin] - <https://wso2.org/jenkins/job/forked-dependencies/job/andes_3.2.x/ws/modules/andes-core/broker/src/main/java> 833 files
[JaCoCo plugin] - <https://wso2.org/jenkins/job/forked-dependencies/job/andes_3.2.x/ws/modules/andes-core/broker/src/test/java> 122 files
[JaCoCo plugin] - <https://wso2.org/jenkins/job/forked-dependencies/job/andes_3.2.x/ws/modules/andes-core/broker/src/velocity/java> 1 files
[JaCoCo plugin] - <https://wso2.org/jenkins/job/forked-dependencies/job/andes_3.2.x/ws/modules/andes-core/client/example/src/main/java> 30 files
[JaCoCo plugin] - <https://wso2.org/jenkins/job/forked-dependencies/job/andes_3.2.x/ws/modules/andes-core/client/src/main/java> 194 files
[JaCoCo plugin] - <https://wso2.org/jenkins/job/forked-dependencies/job/andes_3.2.x/ws/modules/andes-core/client/src/old_test/java> 42 files
[JaCoCo plugin] - <https://wso2.org/jenkins/job/forked-dependencies/job/andes_3.2.x/ws/modules/andes-core/client/src/test/java> 25 files
[JaCoCo plugin] - <https://wso2.org/jenkins/job/forked-dependencies/job/andes_3.2.x/ws/modules/andes-core/common/src/main/java> 229 files
[JaCoCo plugin] - <https://wso2.org/jenkins/job/forked-dependencies/job/andes_3.2.x/ws/modules/andes-core/common/src/test/java> 25 files
[JaCoCo plugin] - <https://wso2.org/jenkins/job/forked-dependencies/job/andes_3.2.x/ws/modules/andes-core/integrationtests/src/main/java> 12 files
[JaCoCo plugin] - <https://wso2.org/jenkins/job/forked-dependencies/job/andes_3.2.x/ws/modules/andes-core/management/common/src/main/java> 27 files
[JaCoCo plugin] - <https://wso2.org/jenkins/job/forked-dependencies/job/andes_3.2.x/ws/modules/andes-core/management/common/src/test/java> 1 files
[JaCoCo plugin] - <https://wso2.org/jenkins/job/forked-dependencies/job/andes_3.2.x/ws/modules/andes-core/management/eclipse-plugin/src/main/java> 64 files
[JaCoCo plugin] - <https://wso2.org/jenkins/job/forked-dependencies/job/andes_3.2.x/ws/modules/andes-core/management/eclipse-plugin/src/test/java> 3 files
[JaCoCo plugin] - <https://wso2.org/jenkins/job/forked-dependencies/job/andes_3.2.x/ws/modules/andes-core/management/example/src/main/java> 3 files
[JaCoCo plugin] - <https://wso2.org/jenkins/job/forked-dependencies/job/andes_3.2.x/ws/modules/andes-core/perftests/src/main/java> 25 files
[JaCoCo plugin] - <https://wso2.org/jenkins/job/forked-dependencies/job/andes_3.2.x/ws/modules/andes-core/systests/src/main/java> 223 files
[JaCoCo plugin] - <https://wso2.org/jenkins/job/forked-dependencies/job/andes_3.2.x/ws/modules/andes-core/testkit/src/main/java> 1 files
[JaCoCo plugin] - <https://wso2.org/jenkins/job/forked-dependencies/job/andes_3.2.x/ws/modules/andes-core/tools/src/main/java> 15 files
[JaCoCo plugin] - <https://wso2.org/jenkins/job/forked-dependencies/job/andes_3.2.x/ws/modules/orbit/andes-client/src/main/java> 1 files
[JaCoCo plugin] - <https://wso2.org/jenkins/job/forked-dependencies/job/andes_3.2.x/ws/modules/orbit/andes/src/main/java> 3 files
[JaCoCo plugin] Loading inclusions files..
[JaCoCo plugin] inclusions: [**/*.class]
[JaCoCo plugin] exclusions: [ ]
[JaCoCo plugin] Thresholds: JacocoHealthReportThresholds [minClass=70, maxClass=70, minMethod=70, maxMethod=70, minLine=70, maxLine=70, minBranch=70, maxBranch=70, minInstruction=70, maxInstruction=70, minComplexity=70, maxComplexity=70]
[JaCoCo plugin] Publishing the results..
[JaCoCo plugin] Loading packages..
[JaCoCo plugin] Done.
[JaCoCo plugin] Overall coverage: class: 0, method: 0, line: 0, branch: 0, instruction: 0
using settings config with name maven-settings-xml
Replacing all maven server entries not found in credentials list is false
Maven RedeployPublisher use remote ECS_PRODUCTION-12da2828b8759a maven settings from : /tmp/settings4515665053741593516.xml
[INFO] Deployment in https://maven.wso2.org/nexus/content/repositories/snapshots/ (id=wso2.snapshots,uniqueVersion=true)
Deploying the main artifact andes-3.2.19.pom
Uploading to wso2.snapshots: https://maven.wso2.org/nexus/content/repositories/snapshots/org/wso2/andes/andes/3.2.19/andes-3.2.19.pom
ERROR: Failed to deploy artifacts: Could not transfer artifact org.wso2.andes:andes:pom:3.2.19 from/to wso2.snapshots (https://maven.wso2.org/nexus/content/repositories/snapshots/): Failed to transfer file https://maven.wso2.org/nexus/content/repositories/snapshots/org/wso2/andes/andes/3.2.19/andes-3.2.19.pom with status code 400
org.apache.maven.artifact.deployer.ArtifactDeploymentException: Failed to deploy artifacts: Could not transfer artifact org.wso2.andes:andes:pom:3.2.19 from/to wso2.snapshots (https://maven.wso2.org/nexus/content/repositories/snapshots/): Failed to transfer file https://maven.wso2.org/nexus/content/repositories/snapshots/org/wso2/andes/andes/3.2.19/andes-3.2.19.pom with status code 400
	at org.apache.maven.artifact.deployer.DefaultArtifactDeployer.deploy(DefaultArtifactDeployer.java:146)
	at hudson.maven.reporters.MavenArtifactRecord.deploy(MavenArtifactRecord.java:198)
	at hudson.maven.RedeployPublisher.perform(RedeployPublisher.java:176)
	at hudson.tasks.BuildStepMonitor$1.perform(BuildStepMonitor.java:20)
	at hudson.model.AbstractBuild$AbstractBuildExecution.perform(AbstractBuild.java:741)
	at hudson.model.AbstractBuild$AbstractBuildExecution.performAllBuildSteps(AbstractBuild.java:690)
	at hudson.maven.MavenModuleSetBuild$MavenModuleSetBuildExecution.post2(MavenModuleSetBuild.java:1074)
	at hudson.model.AbstractBuild$AbstractBuildExecution.post(AbstractBuild.java:635)
	at hudson.model.Run.execute(Run.java:1843)
	at hudson.maven.MavenModuleSetBuild.run(MavenModuleSetBuild.java:543)
	at hudson.model.ResourceController.execute(ResourceController.java:97)
	at hudson.model.Executor.run(Executor.java:429)
Caused by: org.eclipse.aether.deployment.DeploymentException: Failed to deploy artifacts: Could not transfer artifact org.wso2.andes:andes:pom:3.2.19 from/to wso2.snapshots (https://maven.wso2.org/nexus/content/repositories/snapshots/): Failed to transfer file https://maven.wso2.org/nexus/content/repositories/snapshots/org/wso2/andes/andes/3.2.19/andes-3.2.19.pom with status code 400
	at org.eclipse.aether.internal.impl.DefaultDeployer.deploy(DefaultDeployer.java:295)
	at org.eclipse.aether.internal.impl.DefaultDeployer.deploy(DefaultDeployer.java:223)
	at org.eclipse.aether.internal.impl.DefaultRepositorySystem.deploy(DefaultRepositorySystem.java:384)
	at org.apache.maven.artifact.deployer.DefaultArtifactDeployer.deploy(DefaultArtifactDeployer.java:142)
	... 11 more
Caused by: org.eclipse.aether.transfer.ArtifactTransferException: Could not transfer artifact org.wso2.andes:andes:pom:3.2.19 from/to wso2.snapshots (https://maven.wso2.org/nexus/content/repositories/snapshots/): Failed to transfer file https://maven.wso2.org/nexus/content/repositories/snapshots/org/wso2/andes/andes/3.2.19/andes-3.2.19.pom with status code 400
	at org.eclipse.aether.connector.basic.ArtifactTransportListener.transferFailed(ArtifactTransportListener.java:52)
	at org.eclipse.aether.connector.basic.BasicRepositoryConnector$TaskRunner.run(BasicRepositoryConnector.java:365)
	at org.eclipse.aether.connector.basic.BasicRepositoryConnector.put(BasicRepositoryConnector.java:284)
	at org.eclipse.aether.internal.impl.DefaultDeployer.deploy(DefaultDeployer.java:289)
	... 14 more
Caused by: org.apache.maven.wagon.TransferFailedException: Failed to transfer file https://maven.wso2.org/nexus/content/repositories/snapshots/org/wso2/andes/andes/3.2.19/andes-3.2.19.pom with status code 400
	at org.apache.maven.wagon.shared.http.AbstractHttpClientWagon.put(AbstractHttpClientWagon.java:756)
	at org.apache.maven.wagon.shared.http.AbstractHttpClientWagon.put(AbstractHttpClientWagon.java:670)
	at org.apache.maven.wagon.shared.http.AbstractHttpClientWagon.put(AbstractHttpClientWagon.java:652)
	at org.apache.maven.wagon.shared.http.AbstractHttpClientWagon.put(AbstractHttpClientWagon.java:646)
	at org.apache.maven.wagon.shared.http.AbstractHttpClientWagon.put(AbstractHttpClientWagon.java:626)
	at org.eclipse.aether.transport.wagon.WagonTransporter$PutTaskRunner.run(WagonTransporter.java:686)
	at org.eclipse.aether.transport.wagon.WagonTransporter.execute(WagonTransporter.java:435)
	at org.eclipse.aether.transport.wagon.WagonTransporter.put(WagonTransporter.java:418)
	at org.eclipse.aether.connector.basic.BasicRepositoryConnector$PutTaskRunner.runTask(BasicRepositoryConnector.java:512)
	at org.eclipse.aether.connector.basic.BasicRepositoryConnector$TaskRunner.run(BasicRepositoryConnector.java:360)
	... 16 more
[INFO] Deployment failed after 0.56 sec
Build step 'Deploy artifacts to Maven repository' changed build result to FAILURE


More information about the Builder mailing list