[Builder] Build failed in Jenkins: products » product-sp #1539

cbuilder at wso2.org cbuilder at wso2.org
Fri Jul 9 12:27:04 PDT 2021


See <https://wso2.org/jenkins/job/products/job/product-sp/1539/display/redirect>

Changes:


------------------------------------------
[...truncated 127.91 MB...]
    at java.util.concurrent.ThreadPoolExecutor$Worker.run (ThreadPoolExecutor.java:624)
    at java.lang.Thread.run (Thread.java:748)
Caused by: org.eclipse.aether.resolution.ArtifactResolutionException: Could not transfer artifact io.moquette:moquette-broker:pom:0.8 from/to bintray-andsel-maven (http://dl.bintray.com/andsel/maven): Access denied to: http://dl.bintray.com/andsel/maven/io/moquette/moquette-broker/0.8/moquette-broker-0.8.pom , ReasonPhrase:Forbidden.
    at org.eclipse.aether.internal.impl.DefaultArtifactResolver.resolve (DefaultArtifactResolver.java:422)
    at org.eclipse.aether.internal.impl.DefaultArtifactResolver.resolveArtifacts (DefaultArtifactResolver.java:224)
    at org.eclipse.aether.internal.impl.DefaultArtifactResolver.resolveArtifact (DefaultArtifactResolver.java:201)
    at org.apache.maven.repository.internal.DefaultArtifactDescriptorReader.loadPom (DefaultArtifactDescriptorReader.java:261)
    at org.apache.maven.repository.internal.DefaultArtifactDescriptorReader.readArtifactDescriptor (DefaultArtifactDescriptorReader.java:192)
    at org.eclipse.aether.internal.impl.DefaultDependencyCollector.resolveCachedArtifactDescriptor (DefaultDependencyCollector.java:539)
    at org.eclipse.aether.internal.impl.DefaultDependencyCollector.getArtifactDescriptorResult (DefaultDependencyCollector.java:522)
    at org.eclipse.aether.internal.impl.DefaultDependencyCollector.processDependency (DefaultDependencyCollector.java:411)
    at org.eclipse.aether.internal.impl.DefaultDependencyCollector.processDependency (DefaultDependencyCollector.java:365)
    at org.eclipse.aether.internal.impl.DefaultDependencyCollector.process (DefaultDependencyCollector.java:353)
    at org.eclipse.aether.internal.impl.DefaultDependencyCollector.doRecurse (DefaultDependencyCollector.java:507)
    at org.eclipse.aether.internal.impl.DefaultDependencyCollector.processDependency (DefaultDependencyCollector.java:460)
    at org.eclipse.aether.internal.impl.DefaultDependencyCollector.processDependency (DefaultDependencyCollector.java:365)
    at org.eclipse.aether.internal.impl.DefaultDependencyCollector.process (DefaultDependencyCollector.java:353)
    at org.eclipse.aether.internal.impl.DefaultDependencyCollector.collectDependencies (DefaultDependencyCollector.java:256)
    at org.eclipse.aether.internal.impl.DefaultRepositorySystem.collectDependencies (DefaultRepositorySystem.java:282)
    at org.apache.maven.project.DefaultProjectDependenciesResolver.resolve (DefaultProjectDependenciesResolver.java:169)
    at org.apache.maven.lifecycle.internal.LifecycleDependencyResolver.getDependencies (LifecycleDependencyResolver.java:243)
    at org.apache.maven.lifecycle.internal.LifecycleDependencyResolver.resolveProjectDependencies (LifecycleDependencyResolver.java:147)
    at org.apache.maven.lifecycle.internal.MojoExecutor.ensureDependenciesAreResolved (MojoExecutor.java:246)
    at org.apache.maven.lifecycle.internal.MojoExecutor.execute (MojoExecutor.java:200)
    at org.apache.maven.lifecycle.internal.MojoExecutor.execute (MojoExecutor.java:154)
    at org.apache.maven.lifecycle.internal.MojoExecutor.execute (MojoExecutor.java:146)
    at org.apache.maven.lifecycle.internal.LifecycleModuleBuilder.buildProject (LifecycleModuleBuilder.java:117)
    at org.apache.maven.lifecycle.internal.LifecycleModuleBuilder.buildProject (LifecycleModuleBuilder.java:81)
    at org.apache.maven.lifecycle.internal.builder.singlethreaded.SingleThreadedBuilder.build (SingleThreadedBuilder.java:56)
    at org.apache.maven.lifecycle.internal.LifecycleStarter.execute (LifecycleStarter.java:128)
    at org.apache.maven.DefaultMaven.doExecute (DefaultMaven.java:305)
    at org.apache.maven.DefaultMaven.doExecute (DefaultMaven.java:192)
    at org.apache.maven.DefaultMaven.execute (DefaultMaven.java:105)
    at org.jvnet.hudson.maven3.launcher.Maven35Launcher.main (Maven35Launcher.java:130)
    at sun.reflect.NativeMethodAccessorImpl.invoke0 (Native Method)
    at sun.reflect.NativeMethodAccessorImpl.invoke (NativeMethodAccessorImpl.java:62)
    at sun.reflect.DelegatingMethodAccessorImpl.invoke (DelegatingMethodAccessorImpl.java:43)
    at java.lang.reflect.Method.invoke (Method.java:498)
    at org.codehaus.plexus.classworlds.launcher.Launcher.launchEnhanced (Launcher.java:289)
    at org.codehaus.plexus.classworlds.launcher.Launcher.launch (Launcher.java:229)
    at jenkins.maven3.agent.Maven35Main.launch (Maven35Main.java:178)
    at sun.reflect.NativeMethodAccessorImpl.invoke0 (Native Method)
    at sun.reflect.NativeMethodAccessorImpl.invoke (NativeMethodAccessorImpl.java:62)
    at sun.reflect.DelegatingMethodAccessorImpl.invoke (DelegatingMethodAccessorImpl.java:43)
    at java.lang.reflect.Method.invoke (Method.java:498)
    at hudson.maven.Maven3Builder.call (Maven3Builder.java:139)
    at hudson.maven.Maven3Builder.call (Maven3Builder.java:70)
    at hudson.remoting.UserRequest.perform (UserRequest.java:153)
    at hudson.remoting.UserRequest.perform (UserRequest.java:50)
    at hudson.remoting.Request$2.run (Request.java:336)
    at hudson.remoting.InterceptingExecutorService$1.call (InterceptingExecutorService.java:68)
    at java.util.concurrent.FutureTask.run (FutureTask.java:266)
    at java.util.concurrent.ThreadPoolExecutor.runWorker (ThreadPoolExecutor.java:1149)
    at java.util.concurrent.ThreadPoolExecutor$Worker.run (ThreadPoolExecutor.java:624)
    at java.lang.Thread.run (Thread.java:748)
Caused by: org.eclipse.aether.transfer.ArtifactTransferException: Could not transfer artifact io.moquette:moquette-broker:pom:0.8 from/to bintray-andsel-maven (http://dl.bintray.com/andsel/maven): Access denied to: http://dl.bintray.com/andsel/maven/io/moquette/moquette-broker/0.8/moquette-broker-0.8.pom , ReasonPhrase:Forbidden.
    at org.eclipse.aether.connector.basic.ArtifactTransportListener.transferFailed (ArtifactTransportListener.java:52)
    at org.eclipse.aether.connector.basic.BasicRepositoryConnector$TaskRunner.run (BasicRepositoryConnector.java:365)
    at org.eclipse.aether.util.concurrency.RunnableErrorForwarder$1.run (RunnableErrorForwarder.java:75)
    at org.eclipse.aether.connector.basic.BasicRepositoryConnector$DirectExecutor.execute (BasicRepositoryConnector.java:583)
    at org.eclipse.aether.connector.basic.BasicRepositoryConnector.get (BasicRepositoryConnector.java:259)
    at org.eclipse.aether.internal.impl.DefaultArtifactResolver.performDownloads (DefaultArtifactResolver.java:498)
    at org.eclipse.aether.internal.impl.DefaultArtifactResolver.resolve (DefaultArtifactResolver.java:399)
    at org.eclipse.aether.internal.impl.DefaultArtifactResolver.resolveArtifacts (DefaultArtifactResolver.java:224)
    at org.eclipse.aether.internal.impl.DefaultArtifactResolver.resolveArtifact (DefaultArtifactResolver.java:201)
    at org.apache.maven.repository.internal.DefaultArtifactDescriptorReader.loadPom (DefaultArtifactDescriptorReader.java:261)
    at org.apache.maven.repository.internal.DefaultArtifactDescriptorReader.readArtifactDescriptor (DefaultArtifactDescriptorReader.java:192)
    at org.eclipse.aether.internal.impl.DefaultDependencyCollector.resolveCachedArtifactDescriptor (DefaultDependencyCollector.java:539)
    at org.eclipse.aether.internal.impl.DefaultDependencyCollector.getArtifactDescriptorResult (DefaultDependencyCollector.java:522)
    at org.eclipse.aether.internal.impl.DefaultDependencyCollector.processDependency (DefaultDependencyCollector.java:411)
    at org.eclipse.aether.internal.impl.DefaultDependencyCollector.processDependency (DefaultDependencyCollector.java:365)
    at org.eclipse.aether.internal.impl.DefaultDependencyCollector.process (DefaultDependencyCollector.java:353)
    at org.eclipse.aether.internal.impl.DefaultDependencyCollector.doRecurse (DefaultDependencyCollector.java:507)
    at org.eclipse.aether.internal.impl.DefaultDependencyCollector.processDependency (DefaultDependencyCollector.java:460)
    at org.eclipse.aether.internal.impl.DefaultDependencyCollector.processDependency (DefaultDependencyCollector.java:365)
    at org.eclipse.aether.internal.impl.DefaultDependencyCollector.process (DefaultDependencyCollector.java:353)
    at org.eclipse.aether.internal.impl.DefaultDependencyCollector.collectDependencies (DefaultDependencyCollector.java:256)
    at org.eclipse.aether.internal.impl.DefaultRepositorySystem.collectDependencies (DefaultRepositorySystem.java:282)
    at org.apache.maven.project.DefaultProjectDependenciesResolver.resolve (DefaultProjectDependenciesResolver.java:169)
    at org.apache.maven.lifecycle.internal.LifecycleDependencyResolver.getDependencies (LifecycleDependencyResolver.java:243)
    at org.apache.maven.lifecycle.internal.LifecycleDependencyResolver.resolveProjectDependencies (LifecycleDependencyResolver.java:147)
    at org.apache.maven.lifecycle.internal.MojoExecutor.ensureDependenciesAreResolved (MojoExecutor.java:246)
    at org.apache.maven.lifecycle.internal.MojoExecutor.execute (MojoExecutor.java:200)
    at org.apache.maven.lifecycle.internal.MojoExecutor.execute (MojoExecutor.java:154)
    at org.apache.maven.lifecycle.internal.MojoExecutor.execute (MojoExecutor.java:146)
    at org.apache.maven.lifecycle.internal.LifecycleModuleBuilder.buildProject (LifecycleModuleBuilder.java:117)
    at org.apache.maven.lifecycle.internal.LifecycleModuleBuilder.buildProject (LifecycleModuleBuilder.java:81)
    at org.apache.maven.lifecycle.internal.builder.singlethreaded.SingleThreadedBuilder.build (SingleThreadedBuilder.java:56)
    at org.apache.maven.lifecycle.internal.LifecycleStarter.execute (LifecycleStarter.java:128)
    at org.apache.maven.DefaultMaven.doExecute (DefaultMaven.java:305)
    at org.apache.maven.DefaultMaven.doExecute (DefaultMaven.java:192)
    at org.apache.maven.DefaultMaven.execute (DefaultMaven.java:105)
    at org.jvnet.hudson.maven3.launcher.Maven35Launcher.main (Maven35Launcher.java:130)
    at sun.reflect.NativeMethodAccessorImpl.invoke0 (Native Method)
    at sun.reflect.NativeMethodAccessorImpl.invoke (NativeMethodAccessorImpl.java:62)
    at sun.reflect.DelegatingMethodAccessorImpl.invoke (DelegatingMethodAccessorImpl.java:43)
    at java.lang.reflect.Method.invoke (Method.java:498)
    at org.codehaus.plexus.classworlds.launcher.Launcher.launchEnhanced (Launcher.java:289)
    at org.codehaus.plexus.classworlds.launcher.Launcher.launch (Launcher.java:229)
    at jenkins.maven3.agent.Maven35Main.launch (Maven35Main.java:178)
    at sun.reflect.NativeMethodAccessorImpl.invoke0 (Native Method)
    at sun.reflect.NativeMethodAccessorImpl.invoke (NativeMethodAccessorImpl.java:62)
    at sun.reflect.DelegatingMethodAccessorImpl.invoke (DelegatingMethodAccessorImpl.java:43)
    at java.lang.reflect.Method.invoke (Method.java:498)
    at hudson.maven.Maven3Builder.call (Maven3Builder.java:139)
    at hudson.maven.Maven3Builder.call (Maven3Builder.java:70)
    at hudson.remoting.UserRequest.perform (UserRequest.java:153)
    at hudson.remoting.UserRequest.perform (UserRequest.java:50)
    at hudson.remoting.Request$2.run (Request.java:336)
    at hudson.remoting.InterceptingExecutorService$1.call (InterceptingExecutorService.java:68)
    at java.util.concurrent.FutureTask.run (FutureTask.java:266)
    at java.util.concurrent.ThreadPoolExecutor.runWorker (ThreadPoolExecutor.java:1149)
    at java.util.concurrent.ThreadPoolExecutor$Worker.run (ThreadPoolExecutor.java:624)
    at java.lang.Thread.run (Thread.java:748)
Caused by: org.apache.maven.wagon.authorization.AuthorizationException: Access denied to: http://dl.bintray.com/andsel/maven/io/moquette/moquette-broker/0.8/moquette-broker-0.8.pom , ReasonPhrase:Forbidden.
    at org.apache.maven.wagon.providers.http.wagon.shared.AbstractHttpClientWagon.fillInputData (AbstractHttpClientWagon.java:1004)
    at org.apache.maven.wagon.providers.http.wagon.shared.AbstractHttpClientWagon.fillInputData (AbstractHttpClientWagon.java:963)
    at org.apache.maven.wagon.StreamWagon.getInputStream (StreamWagon.java:126)
    at org.apache.maven.wagon.StreamWagon.getIfNewer (StreamWagon.java:88)
    at org.apache.maven.wagon.StreamWagon.get (StreamWagon.java:61)
    at org.eclipse.aether.transport.wagon.WagonTransporter$GetTaskRunner.run (WagonTransporter.java:567)
    at org.eclipse.aether.transport.wagon.WagonTransporter.execute (WagonTransporter.java:435)
    at org.eclipse.aether.transport.wagon.WagonTransporter.get (WagonTransporter.java:412)
    at org.eclipse.aether.connector.basic.BasicRepositoryConnector$GetTaskRunner.runTask (BasicRepositoryConnector.java:453)
    at org.eclipse.aether.connector.basic.BasicRepositoryConnector$TaskRunner.run (BasicRepositoryConnector.java:360)
    at org.eclipse.aether.util.concurrency.RunnableErrorForwarder$1.run (RunnableErrorForwarder.java:75)
    at org.eclipse.aether.connector.basic.BasicRepositoryConnector$DirectExecutor.execute (BasicRepositoryConnector.java:583)
    at org.eclipse.aether.connector.basic.BasicRepositoryConnector.get (BasicRepositoryConnector.java:259)
    at org.eclipse.aether.internal.impl.DefaultArtifactResolver.performDownloads (DefaultArtifactResolver.java:498)
    at org.eclipse.aether.internal.impl.DefaultArtifactResolver.resolve (DefaultArtifactResolver.java:399)
    at org.eclipse.aether.internal.impl.DefaultArtifactResolver.resolveArtifacts (DefaultArtifactResolver.java:224)
    at org.eclipse.aether.internal.impl.DefaultArtifactResolver.resolveArtifact (DefaultArtifactResolver.java:201)
    at org.apache.maven.repository.internal.DefaultArtifactDescriptorReader.loadPom (DefaultArtifactDescriptorReader.java:261)
    at org.apache.maven.repository.internal.DefaultArtifactDescriptorReader.readArtifactDescriptor (DefaultArtifactDescriptorReader.java:192)
    at org.eclipse.aether.internal.impl.DefaultDependencyCollector.resolveCachedArtifactDescriptor (DefaultDependencyCollector.java:539)
    at org.eclipse.aether.internal.impl.DefaultDependencyCollector.getArtifactDescriptorResult (DefaultDependencyCollector.java:522)
    at org.eclipse.aether.internal.impl.DefaultDependencyCollector.processDependency (DefaultDependencyCollector.java:411)
    at org.eclipse.aether.internal.impl.DefaultDependencyCollector.processDependency (DefaultDependencyCollector.java:365)
    at org.eclipse.aether.internal.impl.DefaultDependencyCollector.process (DefaultDependencyCollector.java:353)
    at org.eclipse.aether.internal.impl.DefaultDependencyCollector.doRecurse (DefaultDependencyCollector.java:507)
    at org.eclipse.aether.internal.impl.DefaultDependencyCollector.processDependency (DefaultDependencyCollector.java:460)
    at org.eclipse.aether.internal.impl.DefaultDependencyCollector.processDependency (DefaultDependencyCollector.java:365)
    at org.eclipse.aether.internal.impl.DefaultDependencyCollector.process (DefaultDependencyCollector.java:353)
    at org.eclipse.aether.internal.impl.DefaultDependencyCollector.collectDependencies (DefaultDependencyCollector.java:256)
    at org.eclipse.aether.internal.impl.DefaultRepositorySystem.collectDependencies (DefaultRepositorySystem.java:282)
    at org.apache.maven.project.DefaultProjectDependenciesResolver.resolve (DefaultProjectDependenciesResolver.java:169)
    at org.apache.maven.lifecycle.internal.LifecycleDependencyResolver.getDependencies (LifecycleDependencyResolver.java:243)
    at org.apache.maven.lifecycle.internal.LifecycleDependencyResolver.resolveProjectDependencies (LifecycleDependencyResolver.java:147)
    at org.apache.maven.lifecycle.internal.MojoExecutor.ensureDependenciesAreResolved (MojoExecutor.java:246)
    at org.apache.maven.lifecycle.internal.MojoExecutor.execute (MojoExecutor.java:200)
    at org.apache.maven.lifecycle.internal.MojoExecutor.execute (MojoExecutor.java:154)
    at org.apache.maven.lifecycle.internal.MojoExecutor.execute (MojoExecutor.java:146)
    at org.apache.maven.lifecycle.internal.LifecycleModuleBuilder.buildProject (LifecycleModuleBuilder.java:117)
    at org.apache.maven.lifecycle.internal.LifecycleModuleBuilder.buildProject (LifecycleModuleBuilder.java:81)
    at org.apache.maven.lifecycle.internal.builder.singlethreaded.SingleThreadedBuilder.build (SingleThreadedBuilder.java:56)
    at org.apache.maven.lifecycle.internal.LifecycleStarter.execute (LifecycleStarter.java:128)
    at org.apache.maven.DefaultMaven.doExecute (DefaultMaven.java:305)
    at org.apache.maven.DefaultMaven.doExecute (DefaultMaven.java:192)
    at org.apache.maven.DefaultMaven.execute (DefaultMaven.java:105)
    at org.jvnet.hudson.maven3.launcher.Maven35Launcher.main (Maven35Launcher.java:130)
    at sun.reflect.NativeMethodAccessorImpl.invoke0 (Native Method)
    at sun.reflect.NativeMethodAccessorImpl.invoke (NativeMethodAccessorImpl.java:62)
    at sun.reflect.DelegatingMethodAccessorImpl.invoke (DelegatingMethodAccessorImpl.java:43)
    at java.lang.reflect.Method.invoke (Method.java:498)
    at org.codehaus.plexus.classworlds.launcher.Launcher.launchEnhanced (Launcher.java:289)
    at org.codehaus.plexus.classworlds.launcher.Launcher.launch (Launcher.java:229)
    at jenkins.maven3.agent.Maven35Main.launch (Maven35Main.java:178)
    at sun.reflect.NativeMethodAccessorImpl.invoke0 (Native Method)
    at sun.reflect.NativeMethodAccessorImpl.invoke (NativeMethodAccessorImpl.java:62)
    at sun.reflect.DelegatingMethodAccessorImpl.invoke (DelegatingMethodAccessorImpl.java:43)
    at java.lang.reflect.Method.invoke (Method.java:498)
    at hudson.maven.Maven3Builder.call (Maven3Builder.java:139)
    at hudson.maven.Maven3Builder.call (Maven3Builder.java:70)
    at hudson.remoting.UserRequest.perform (UserRequest.java:153)
    at hudson.remoting.UserRequest.perform (UserRequest.java:50)
    at hudson.remoting.Request$2.run (Request.java:336)
    at hudson.remoting.InterceptingExecutorService$1.call (InterceptingExecutorService.java:68)
    at java.util.concurrent.FutureTask.run (FutureTask.java:266)
    at java.util.concurrent.ThreadPoolExecutor.runWorker (ThreadPoolExecutor.java:1149)
    at java.util.concurrent.ThreadPoolExecutor$Worker.run (ThreadPoolExecutor.java:624)
    at java.lang.Thread.run (Thread.java:748)
[ERROR] 
[ERROR] Re-run Maven using the -X switch to enable full debug logging.
[ERROR] 
[ERROR] For more information about the errors and possible solutions, please read the following articles:
[ERROR] [Help 1] http://cwiki.apache.org/confluence/display/MAVEN/DependencyResolutionException
[ERROR] 
[ERROR] After correcting the problems, you can resume the build with the command
[ERROR]   mvn <goals> -rf :mqtt-client
[JENKINS] Archiving <https://wso2.org/jenkins/job/products/job/product-sp/ws/modules/samples/sample-clients/tcp-server/pom.xml> to org.wso2.sp/tcp-server/4.5.0-SNAPSHOT/tcp-server-4.5.0-SNAPSHOT.pom
[JENKINS] Archiving <https://wso2.org/jenkins/job/products/job/product-sp/ws/modules/samples/sample-clients/mqtt-consumer/pom.xml> to org.wso2.sp/mqtt-consumer/4.5.0-SNAPSHOT/mqtt-consumer-4.5.0-SNAPSHOT.pom
[JENKINS] Archiving <https://wso2.org/jenkins/job/products/job/product-sp/ws/modules/samples/sample-clients/mqtt-client/pom.xml> to org.wso2.sp/mqtt-client/4.5.0-SNAPSHOT/mqtt-client-4.5.0-SNAPSHOT.pom
[JENKINS] Archiving <https://wso2.org/jenkins/job/products/job/product-sp/ws/modules/samples/sample-clients/rabbitmq-producer/pom.xml> to org.wso2.sp/rabbitmq-producer/4.5.0-SNAPSHOT/rabbitmq-producer-4.5.0-SNAPSHOT.pom
[JENKINS] Archiving <https://wso2.org/jenkins/job/products/job/product-sp/ws/modules/samples/sample-clients/http-server/pom.xml> to org.wso2.sp/http-server/4.5.0-SNAPSHOT/http-server-4.5.0-SNAPSHOT.pom
[JENKINS] Archiving <https://wso2.org/jenkins/job/products/job/product-sp/ws/modules/samples/sample-clients/is-analytics-client/pom.xml> to org.wso2.sp/is-analytics-client/4.5.0-SNAPSHOT/is-analytics-client-4.5.0-SNAPSHOT.pom
[JENKINS] Archiving <https://wso2.org/jenkins/job/products/job/product-sp/ws/modules/samples/sample-clients/tcp-client/pom.xml> to org.wso2.sp/tcp-client/4.5.0-SNAPSHOT/tcp-client-4.5.0-SNAPSHOT.pom
[JENKINS] Archiving <https://wso2.org/jenkins/job/products/job/product-sp/ws/modules/samples/sample-clients/kafka-consumer/pom.xml> to org.wso2.sp/kafka-consumer/4.5.0-SNAPSHOT/kafka-consumer-4.5.0-SNAPSHOT.pom
[JENKINS] Archiving <https://wso2.org/jenkins/job/products/job/product-sp/ws/modules/distribution/pom.xml> to org.wso2.sp/wso2sp/4.5.0-SNAPSHOT/wso2sp-4.5.0-SNAPSHOT.pom
[JENKINS] Archiving <https://wso2.org/jenkins/job/products/job/product-sp/ws/modules/distribution/target/wso2sp-4.5.0-SNAPSHOT.zip> to org.wso2.sp/wso2sp/4.5.0-SNAPSHOT/wso2sp-4.5.0-SNAPSHOT.zip
[JENKINS] Archiving <https://wso2.org/jenkins/job/products/job/product-sp/ws/modules/samples/sample-clients/kafka-avro-consumer/pom.xml> to org.wso2.sp/kafka-avro-consumer/4.5.0-SNAPSHOT/kafka-avro-consumer-4.5.0-SNAPSHOT.pom
[JENKINS] Archiving <https://wso2.org/jenkins/job/products/job/product-sp/ws/modules/samples/sample-clients/rabbitmq-consumer/pom.xml> to org.wso2.sp/rabbitmq-consumer/4.5.0-SNAPSHOT/rabbitmq-consumer-4.5.0-SNAPSHOT.pom
[JENKINS] Archiving <https://wso2.org/jenkins/job/products/job/product-sp/ws/modules/samples/sample-clients/prometheus-client/pom.xml> to org.wso2.sp/prometheus-client/4.5.0-SNAPSHOT/prometheus-client-4.5.0-SNAPSHOT.pom
[JENKINS] Archiving <https://wso2.org/jenkins/job/products/job/product-sp/ws/modules/tests/pom.xml> to org.wso2.sp/tests/4.5.0-SNAPSHOT/tests-4.5.0-SNAPSHOT.pom
[JENKINS] Archiving <https://wso2.org/jenkins/job/products/job/product-sp/ws/modules/samples/sample-clients/wso2event-client/pom.xml> to org.wso2.sp/wso2event-client/4.5.0-SNAPSHOT/wso2event-client-4.5.0-SNAPSHOT.pom
[JENKINS] Archiving <https://wso2.org/jenkins/job/products/job/product-sp/ws/modules/samples/sample-clients/jms-consumer/pom.xml> to org.wso2.sp/jms-consumer/4.5.0-SNAPSHOT/jms-consumer-4.5.0-SNAPSHOT.pom
[JENKINS] Archiving <https://wso2.org/jenkins/job/products/job/product-sp/ws/pom.xml> to org.wso2.sp/org.wso2.carbon.sp.parent/4.5.0-SNAPSHOT/org.wso2.carbon.sp.parent-4.5.0-SNAPSHOT.pom
[JENKINS] Archiving <https://wso2.org/jenkins/job/products/job/product-sp/ws/modules/samples/sample-clients/http-client/pom.xml> to org.wso2.sp/http-client/4.5.0-SNAPSHOT/http-client-4.5.0-SNAPSHOT.pom
[JENKINS] Archiving <https://wso2.org/jenkins/job/products/job/product-sp/ws/modules/samples/sample-clients/websocket-producer/pom.xml> to org.wso2.sp/websocket-client/4.5.0-SNAPSHOT/websocket-client-4.5.0-SNAPSHOT.pom
[JENKINS] Archiving <https://wso2.org/jenkins/job/products/job/product-sp/ws/modules/samples/sample-clients/apim-event-client/pom.xml> to org.wso2.sp/apim-event-client/4.5.0-SNAPSHOT/apim-event-client-4.5.0-SNAPSHOT.pom
[JENKINS] Archiving <https://wso2.org/jenkins/job/products/job/product-sp/ws/modules/samples/sample-clients/ei-analytics-client/pom.xml> to org.wso2.sp/ei-analytics-client/4.5.0-SNAPSHOT/ei-analytics-client-4.5.0-SNAPSHOT.pom
[JENKINS] Archiving <https://wso2.org/jenkins/job/products/job/product-sp/ws/modules/integration/pom.xml> to org.wso2.sp/wso2sp-integration/4.5.0-SNAPSHOT/wso2sp-integration-4.5.0-SNAPSHOT.pom
[JENKINS] Archiving <https://wso2.org/jenkins/job/products/job/product-sp/ws/modules/samples/sample-clients/wso2event-server/pom.xml> to org.wso2.sp/wso2event-server/4.5.0-SNAPSHOT/wso2event-server-4.5.0-SNAPSHOT.pom
[JENKINS] Archiving <https://wso2.org/jenkins/job/products/job/product-sp/ws/modules/samples/sample-clients/pom.xml> to org.wso2.sp/sample-clients/4.5.0-SNAPSHOT/sample-clients-4.5.0-SNAPSHOT.pom
[JENKINS] Archiving <https://wso2.org/jenkins/job/products/job/product-sp/ws/modules/performance/pom.xml> to org.wso2.sp/wso2sp-performance/4.5.0-SNAPSHOT/wso2sp-performance-4.5.0-SNAPSHOT.pom
[JENKINS] Archiving <https://wso2.org/jenkins/job/products/job/product-sp/ws/modules/samples/sample-clients/websocket-receiver/pom.xml> to org.wso2.sp/websocket-receiver/4.5.0-SNAPSHOT/websocket-receiver-4.5.0-SNAPSHOT.pom
[JENKINS] Archiving <https://wso2.org/jenkins/job/products/job/product-sp/ws/modules/samples/sample-clients/kafka-producer/pom.xml> to org.wso2.sp/kafka-producer/4.5.0-SNAPSHOT/kafka-producer-4.5.0-SNAPSHOT.pom
[JENKINS] Archiving <https://wso2.org/jenkins/job/products/job/product-sp/ws/modules/samples/sample-clients/jms-producer/pom.xml> to org.wso2.sp/jms-producer/4.5.0-SNAPSHOT/jms-producer-4.5.0-SNAPSHOT.pom
No mail will be sent out, as 'products ? product-sp ? WSO2 Stream Processor - Sample - TCP Server #1539' does not have a result yet. Please make sure you set a proper result in case of pipeline/build scripts.
No mail will be sent out, as 'products ? product-sp ? WSO2 Stream Processor - Sample - Mqtt Consumer #1539' does not have a result yet. Please make sure you set a proper result in case of pipeline/build scripts.
Sending e-mails to: builder at wso2.org
No mail will be sent out, as 'products ? product-sp ? WSO2 Stream Processor - Sample - RabbitMQ Producer #1539' does not have a result yet. Please make sure you set a proper result in case of pipeline/build scripts.
No mail will be sent out, as 'products ? product-sp ? WSO2 Stream Processor - Sample - HTTP Server #1539' does not have a result yet. Please make sure you set a proper result in case of pipeline/build scripts.
No mail will be sent out, as 'products ? product-sp ? WSO2 Stream Processor - IS Analytics - WSO2Event Client #1539' does not have a result yet. Please make sure you set a proper result in case of pipeline/build scripts.
No mail will be sent out, as 'products ? product-sp ? WSO2 Stream Processor - Sample - TCP Client #1539' does not have a result yet. Please make sure you set a proper result in case of pipeline/build scripts.
No mail will be sent out, as 'products ? product-sp ? WSO2 Stream Processor - Sample - Kafka Consumer #1539' does not have a result yet. Please make sure you set a proper result in case of pipeline/build scripts.
No mail will be sent out, as 'products ? product-sp ? WSO2 Stream Processor - Distribution #1539' does not have a result yet. Please make sure you set a proper result in case of pipeline/build scripts.
No mail will be sent out, as 'products ? product-sp ? WSO2 Stream Processor - Sample - Kafka Avro Consumer #1539' does not have a result yet. Please make sure you set a proper result in case of pipeline/build scripts.
No mail will be sent out, as 'products ? product-sp ? WSO2 Stream Processor - Sample - RabbitMQ Consumer #1539' does not have a result yet. Please make sure you set a proper result in case of pipeline/build scripts.
No mail will be sent out, as 'products ? product-sp ? WSO2 Stream Processor - Prometheus Source - Event Client #1539' does not have a result yet. Please make sure you set a proper result in case of pipeline/build scripts.
No mail will be sent out, as 'products ? product-sp ? WSO2 Stream Processor - Tests #1539' does not have a result yet. Please make sure you set a proper result in case of pipeline/build scripts.
No mail will be sent out, as 'products ? product-sp ? WSO2 Stream Processor - Sample - WSO2Event Client #1539' does not have a result yet. Please make sure you set a proper result in case of pipeline/build scripts.
No mail will be sent out, as 'products ? product-sp ? WSO2 Stream Processor - Sample - JMS Consumer #1539' does not have a result yet. Please make sure you set a proper result in case of pipeline/build scripts.
No mail will be sent out, as 'products ? product-sp ? WSO2 Stream Processor - Parent #1539' does not have a result yet. Please make sure you set a proper result in case of pipeline/build scripts.
No mail will be sent out, as 'products ? product-sp ? WSO2 Stream Processor - Sample - HTTP Client #1539' does not have a result yet. Please make sure you set a proper result in case of pipeline/build scripts.
No mail will be sent out, as 'products ? product-sp ? WSO2 Stream Processor - Sample - WebSocket Client #1539' does not have a result yet. Please make sure you set a proper result in case of pipeline/build scripts.
No mail will be sent out, as 'products ? product-sp ? WSO2 Stream Processor - Sample - apim-event-client #1539' does not have a result yet. Please make sure you set a proper result in case of pipeline/build scripts.
No mail will be sent out, as 'products ? product-sp ? WSO2 Stream Processor - EI Analytics - WSO2Event Client #1539' does not have a result yet. Please make sure you set a proper result in case of pipeline/build scripts.
No mail will be sent out, as 'products ? product-sp ? WSO2 Stream Processor - Integration Tests #1539' does not have a result yet. Please make sure you set a proper result in case of pipeline/build scripts.
No mail will be sent out, as 'products ? product-sp ? WSO2 Stream Processor - Sample - WSO2Event Server #1539' does not have a result yet. Please make sure you set a proper result in case of pipeline/build scripts.
No mail will be sent out, as 'products ? product-sp ? WSO2 Stream Processor - Sample Clients #1539' does not have a result yet. Please make sure you set a proper result in case of pipeline/build scripts.
No mail will be sent out, as 'products ? product-sp ? WSO2 Stream Processor - Performance #1539' does not have a result yet. Please make sure you set a proper result in case of pipeline/build scripts.
No mail will be sent out, as 'products ? product-sp ? WSO2 Stream Processor - Sample - WebSocket Consumer #1539' does not have a result yet. Please make sure you set a proper result in case of pipeline/build scripts.
No mail will be sent out, as 'products ? product-sp ? WSO2 Stream Processor - Sample - Kafka Producer #1539' does not have a result yet. Please make sure you set a proper result in case of pipeline/build scripts.
No mail will be sent out, as 'products ? product-sp ? WSO2 Stream Processor - Sample - Kafka Producer #1539' does not have a result yet. Please make sure you set a proper result in case of pipeline/build scripts.
executing script 'Script - Kill Carbon Servers'
channel stopped
[product-sp] $ /bin/bash /tmp/build_step_template3718197362688430329.sh
Running port and java processes validation has become successful.
Archiving artifacts


More information about the Builder mailing list