[Builder] Build failed in Jenkins: products » product-es #8430

cbuilder at wso2.org cbuilder at wso2.org
Fri Aug 5 00:21:45 PDT 2022


See <https://wso2.org/jenkins/job/products/job/product-es/8430/display/redirect>

Changes:


------------------------------------------
[...truncated 1.16 MB...]
INFO  [org.wso2.carbon.automation.engine.testlisteners.TestManagerListener] - =================== Running the test method org.wso2.carbon.registry.es.publisher.generic.RestResourcePublisherESTestCase.authenticatePublisher ===================
INFO  [org.wso2.carbon.automation.engine.testlisteners.TestManagerListener] - =================== On test success org.wso2.carbon.registry.es.publisher.generic.RestResourcePublisherESTestCase.authenticatePublisher ===================
INFO  [org.apache.axis2.deployment.ModuleDeployer] - Deploying module: ComponentMgtModule-4.4.7 - <https://wso2.org/jenkins/job/products/job/product-es/ws/.repository/org/wso2/carbon/org.wso2.carbon.feature.mgt.services/4.4.7/org.wso2.carbon.feature.mgt.services-4.4.7.jar>
INFO  [org.apache.axis2.deployment.ModuleDeployer] - Deploying module: rampart - <https://wso2.org/jenkins/job/products/job/product-es/ws/.repository/org/apache/rampart/wso2/rampart-core/1.6.1.wso2v21/rampart-core-1.6.1.wso2v21.jar>
INFO  [org.apache.axis2.deployment.ModuleDeployer] - Deploying module: uddiversionmodule-4.6.0 - <https://wso2.org/jenkins/job/products/job/product-es/ws/.repository/org/wso2/carbon/registry/org.wso2.carbon.registry.uddi/4.6.0/org.wso2.carbon.registry.uddi-4.6.0.jar>
INFO  [org.apache.axis2.deployment.ModuleDeployer] - Deploying module: pagination-4.4.7 - <https://wso2.org/jenkins/job/products/job/product-es/ws/.repository/org/wso2/carbon/org.wso2.carbon.registry.server/4.4.7/org.wso2.carbon.registry.server-4.4.7.jar>
INFO  [org.wso2.carbon.automation.extensions.servers.utils.ServerLogReader] - [2022-08-05 06:57:08,334]  INFO {org.wso2.carbon.core.services.util.CarbonAuthenticationUtil} -  'admin at carbon.super [-1234]' logged in at [2022-08-05 06:57:08,334+0000]
INFO  [org.wso2.carbon.integration.common.admin.client.AuthenticatorClient] - Login Successful
INFO  [org.wso2.carbon.automation.engine.testlisteners.TestManagerListener] - =================== Running the test method org.wso2.carbon.registry.es.authentication.PublisherLoginTestCase.loginPublisher ===================
INFO  [org.wso2.carbon.automation.engine.testlisteners.TestManagerListener] - =================== On test success org.wso2.carbon.registry.es.authentication.PublisherLoginTestCase.loginPublisher ===================
INFO  [org.wso2.carbon.automation.engine.testlisteners.TestManagerListener] - =================== Running the test method org.wso2.carbon.registry.es.publisher.generic.RestResourcePublisherESTestCase.createRestServiceAsset ===================
INFO  [org.wso2.carbon.automation.engine.testlisteners.TestManagerListener] - =================== On test success org.wso2.carbon.registry.es.publisher.generic.RestResourcePublisherESTestCase.createRestServiceAsset ===================
INFO  [org.wso2.carbon.automation.engine.testlisteners.TestManagerListener] - =================== Running the test method org.wso2.carbon.registry.es.publisher.generic.RestResourcePublisherESTestCase.updateRestServiceAsset ===================
INFO  [org.wso2.carbon.automation.engine.testlisteners.TestManagerListener] - =================== On test success org.wso2.carbon.registry.es.publisher.generic.RestResourcePublisherESTestCase.updateRestServiceAsset ===================
INFO  [org.wso2.carbon.automation.engine.testlisteners.TestManagerListener] - =================== Running the test method org.wso2.carbon.registry.es.publisher.generic.RestResourcePublisherESTestCase.deleteRestServiceAsset ===================
INFO  [org.wso2.carbon.automation.extensions.servers.utils.ServerLogReader] - [2022-08-05 06:57:12,843] ERROR {rxt.asset} -  Unable to add meta data to an empty asset
INFO  [org.wso2.carbon.automation.engine.testlisteners.TestManagerListener] - =================== On test success org.wso2.carbon.registry.es.publisher.generic.RestResourcePublisherESTestCase.deleteRestServiceAsset ===================
INFO  [org.wso2.carbon.automation.extensions.servers.utils.ServerLogReader] - [2022-08-05 06:57:12,875] ERROR {rxt.asset} -  Unable to add meta data to an empty asset
INFO  [org.wso2.carbon.automation.engine.testlisteners.TestSuiteListener] - Inside Test Suite Listener - On Finish
INFO  [org.wso2.carbon.automation.engine.testlisteners.TestExecutionListener] - Inside Test Execution Listener - On Finish
INFO  [org.apache.axis2.deployment.ModuleDeployer] - Deploying module: ComponentMgtModule-4.4.7 - <https://wso2.org/jenkins/job/products/job/product-es/ws/.repository/org/wso2/carbon/org.wso2.carbon.feature.mgt.services/4.4.7/org.wso2.carbon.feature.mgt.services-4.4.7.jar>
INFO  [org.apache.axis2.deployment.ModuleDeployer] - Deploying module: rampart - <https://wso2.org/jenkins/job/products/job/product-es/ws/.repository/org/apache/rampart/wso2/rampart-core/1.6.1.wso2v21/rampart-core-1.6.1.wso2v21.jar>
INFO  [org.apache.axis2.deployment.ModuleDeployer] - Deploying module: uddiversionmodule-4.6.0 - <https://wso2.org/jenkins/job/products/job/product-es/ws/.repository/org/wso2/carbon/registry/org.wso2.carbon.registry.uddi/4.6.0/org.wso2.carbon.registry.uddi-4.6.0.jar>
INFO  [org.apache.axis2.deployment.ModuleDeployer] - Deploying module: pagination-4.4.7 - <https://wso2.org/jenkins/job/products/job/product-es/ws/.repository/org/wso2/carbon/org.wso2.carbon.registry.server/4.4.7/org.wso2.carbon.registry.server-4.4.7.jar>
INFO  [org.wso2.carbon.automation.extensions.servers.utils.ServerLogReader] - [2022-08-05 06:57:12,939]  INFO {org.wso2.carbon.core.services.util.CarbonAuthenticationUtil} -  'admin at carbon.super [-1234]' logged in at [2022-08-05 06:57:12,939+0000]
INFO  [org.wso2.carbon.integration.common.admin.client.AuthenticatorClient] - Login Successful
INFO  [org.apache.axis2.deployment.ModuleDeployer] - Deploying module: ComponentMgtModule-4.4.7 - <https://wso2.org/jenkins/job/products/job/product-es/ws/.repository/org/wso2/carbon/org.wso2.carbon.feature.mgt.services/4.4.7/org.wso2.carbon.feature.mgt.services-4.4.7.jar>
INFO  [org.apache.axis2.deployment.ModuleDeployer] - Deploying module: rampart - <https://wso2.org/jenkins/job/products/job/product-es/ws/.repository/org/apache/rampart/wso2/rampart-core/1.6.1.wso2v21/rampart-core-1.6.1.wso2v21.jar>
INFO  [org.apache.axis2.deployment.ModuleDeployer] - Deploying module: uddiversionmodule-4.6.0 - <https://wso2.org/jenkins/job/products/job/product-es/ws/.repository/org/wso2/carbon/registry/org.wso2.carbon.registry.uddi/4.6.0/org.wso2.carbon.registry.uddi-4.6.0.jar>
INFO  [org.apache.axis2.deployment.ModuleDeployer] - Deploying module: pagination-4.4.7 - <https://wso2.org/jenkins/job/products/job/product-es/ws/.repository/org/wso2/carbon/org.wso2.carbon.registry.server/4.4.7/org.wso2.carbon.registry.server-4.4.7.jar>
INFO  [org.wso2.carbon.integration.common.extensions.usermgt.UserPopulator] - User was deleted successfully - testuser11
INFO  [org.wso2.carbon.integration.common.extensions.usermgt.UserPopulator] - User was deleted successfully - testuser21
INFO  [org.apache.axis2.deployment.ModuleDeployer] - Deploying module: ComponentMgtModule-4.4.7 - <https://wso2.org/jenkins/job/products/job/product-es/ws/.repository/org/wso2/carbon/org.wso2.carbon.feature.mgt.services/4.4.7/org.wso2.carbon.feature.mgt.services-4.4.7.jar>
INFO  [org.apache.axis2.deployment.ModuleDeployer] - Deploying module: rampart - <https://wso2.org/jenkins/job/products/job/product-es/ws/.repository/org/apache/rampart/wso2/rampart-core/1.6.1.wso2v21/rampart-core-1.6.1.wso2v21.jar>
INFO  [org.apache.axis2.deployment.ModuleDeployer] - Deploying module: uddiversionmodule-4.6.0 - <https://wso2.org/jenkins/job/products/job/product-es/ws/.repository/org/wso2/carbon/registry/org.wso2.carbon.registry.uddi/4.6.0/org.wso2.carbon.registry.uddi-4.6.0.jar>
INFO  [org.apache.axis2.deployment.ModuleDeployer] - Deploying module: pagination-4.4.7 - <https://wso2.org/jenkins/job/products/job/product-es/ws/.repository/org/wso2/carbon/org.wso2.carbon.registry.server/4.4.7/org.wso2.carbon.registry.server-4.4.7.jar>
INFO  [org.wso2.carbon.automation.extensions.servers.utils.ServerLogReader] - [2022-08-05 06:57:13,066]  INFO {org.wso2.carbon.core.services.util.CarbonAuthenticationUtil} -  'admin at carbon.super [-1234]' logged in at [2022-08-05 06:57:13,066+0000]
INFO  [org.wso2.carbon.integration.common.admin.client.AuthenticatorClient] - Login Successful
INFO  [org.apache.axis2.deployment.ModuleDeployer] - Deploying module: ComponentMgtModule-4.4.7 - <https://wso2.org/jenkins/job/products/job/product-es/ws/.repository/org/wso2/carbon/org.wso2.carbon.feature.mgt.services/4.4.7/org.wso2.carbon.feature.mgt.services-4.4.7.jar>
INFO  [org.apache.axis2.deployment.ModuleDeployer] - Deploying module: rampart - <https://wso2.org/jenkins/job/products/job/product-es/ws/.repository/org/apache/rampart/wso2/rampart-core/1.6.1.wso2v21/rampart-core-1.6.1.wso2v21.jar>
INFO  [org.apache.axis2.deployment.ModuleDeployer] - Deploying module: uddiversionmodule-4.6.0 - <https://wso2.org/jenkins/job/products/job/product-es/ws/.repository/org/wso2/carbon/registry/org.wso2.carbon.registry.uddi/4.6.0/org.wso2.carbon.registry.uddi-4.6.0.jar>
INFO  [org.apache.axis2.deployment.ModuleDeployer] - Deploying module: pagination-4.4.7 - <https://wso2.org/jenkins/job/products/job/product-es/ws/.repository/org/wso2/carbon/org.wso2.carbon.registry.server/4.4.7/org.wso2.carbon.registry.server-4.4.7.jar>
INFO  [org.wso2.carbon.automation.extensions.servers.utils.ServerLogReader] - [2022-08-05 06:57:13,105] @wso2.com [1] [ES] INFO {org.wso2.carbon.core.multitenancy.utils.TenantAxisUtils} -  Starting to clean tenant : wso2.com
INFO  [org.wso2.carbon.automation.extensions.servers.utils.ServerLogReader] - [2022-08-05 06:57:13,112] @wso2.com [1] [ES] INFO {org.wso2.carbon.core.multitenancy.utils.TenantAxisUtils} -  Cleaned up tenant wso2.com
INFO  [org.wso2.carbon.integration.common.extensions.usermgt.UserPopulator] - Tenant was deleted successfully - wso2.com
INFO  [org.apache.axis2.deployment.ModuleDeployer] - Deploying module: ComponentMgtModule-4.4.7 - <https://wso2.org/jenkins/job/products/job/product-es/ws/.repository/org/wso2/carbon/org.wso2.carbon.feature.mgt.services/4.4.7/org.wso2.carbon.feature.mgt.services-4.4.7.jar>
INFO  [org.apache.axis2.deployment.ModuleDeployer] - Deploying module: rampart - <https://wso2.org/jenkins/job/products/job/product-es/ws/.repository/org/apache/rampart/wso2/rampart-core/1.6.1.wso2v21/rampart-core-1.6.1.wso2v21.jar>
INFO  [org.apache.axis2.deployment.ModuleDeployer] - Deploying module: uddiversionmodule-4.6.0 - <https://wso2.org/jenkins/job/products/job/product-es/ws/.repository/org/wso2/carbon/registry/org.wso2.carbon.registry.uddi/4.6.0/org.wso2.carbon.registry.uddi-4.6.0.jar>
INFO  [org.apache.axis2.deployment.ModuleDeployer] - Deploying module: pagination-4.4.7 - <https://wso2.org/jenkins/job/products/job/product-es/ws/.repository/org/wso2/carbon/org.wso2.carbon.registry.server/4.4.7/org.wso2.carbon.registry.server-4.4.7.jar>
INFO  [org.wso2.carbon.automation.extensions.servers.utils.ServerLogReader] - [2022-08-05 06:57:13,160]  INFO {org.wso2.carbon.core.services.util.CarbonAuthenticationUtil} -  'admin at carbon.super [-1234]' logged in at [2022-08-05 06:57:13,160+0000]
INFO  [org.wso2.carbon.integration.common.admin.client.AuthenticatorClient] - Login Successful
INFO  [org.apache.axis2.deployment.ModuleDeployer] - Deploying module: ComponentMgtModule-4.4.7 - <https://wso2.org/jenkins/job/products/job/product-es/ws/.repository/org/wso2/carbon/org.wso2.carbon.feature.mgt.services/4.4.7/org.wso2.carbon.feature.mgt.services-4.4.7.jar>
INFO  [org.apache.axis2.deployment.ModuleDeployer] - Deploying module: rampart - <https://wso2.org/jenkins/job/products/job/product-es/ws/.repository/org/apache/rampart/wso2/rampart-core/1.6.1.wso2v21/rampart-core-1.6.1.wso2v21.jar>
INFO  [org.apache.axis2.deployment.ModuleDeployer] - Deploying module: uddiversionmodule-4.6.0 - <https://wso2.org/jenkins/job/products/job/product-es/ws/.repository/org/wso2/carbon/registry/org.wso2.carbon.registry.uddi/4.6.0/org.wso2.carbon.registry.uddi-4.6.0.jar>
INFO  [org.apache.axis2.deployment.ModuleDeployer] - Deploying module: pagination-4.4.7 - <https://wso2.org/jenkins/job/products/job/product-es/ws/.repository/org/wso2/carbon/org.wso2.carbon.registry.server/4.4.7/org.wso2.carbon.registry.server-4.4.7.jar>
INFO  [org.wso2.carbon.automation.extensions.servers.utils.ServerLogReader] - [2022-08-05 06:57:13,193] @abc.com [2] [ES] INFO {org.wso2.carbon.core.multitenancy.utils.TenantAxisUtils} -  Starting to clean tenant : abc.com
INFO  [org.wso2.carbon.automation.extensions.servers.utils.ServerLogReader] - [2022-08-05 06:57:13,197] @abc.com [2] [ES] INFO {org.wso2.carbon.core.multitenancy.utils.TenantAxisUtils} -  Cleaned up tenant abc.com
INFO  [org.wso2.carbon.integration.common.extensions.usermgt.UserPopulator] - Tenant was deleted successfully - abc.com
INFO  [org.wso2.carbon.automation.extensions.servers.carbonserver.CarbonServerManager] - Shutting down server..
INFO  [org.wso2.carbon.automation.extensions.servers.utils.ClientConnectionUtil] - Successfully connected to the server on port 10343
INFO  [org.apache.axis2.deployment.ModuleDeployer] - Deploying module: ComponentMgtModule-4.4.7 - <https://wso2.org/jenkins/job/products/job/product-es/ws/.repository/org/wso2/carbon/org.wso2.carbon.feature.mgt.services/4.4.7/org.wso2.carbon.feature.mgt.services-4.4.7.jar>
INFO  [org.apache.axis2.deployment.ModuleDeployer] - Deploying module: rampart - <https://wso2.org/jenkins/job/products/job/product-es/ws/.repository/org/apache/rampart/wso2/rampart-core/1.6.1.wso2v21/rampart-core-1.6.1.wso2v21.jar>
INFO  [org.apache.axis2.deployment.ModuleDeployer] - Deploying module: uddiversionmodule-4.6.0 - <https://wso2.org/jenkins/job/products/job/product-es/ws/.repository/org/wso2/carbon/registry/org.wso2.carbon.registry.uddi/4.6.0/org.wso2.carbon.registry.uddi-4.6.0.jar>
INFO  [org.apache.axis2.deployment.ModuleDeployer] - Deploying module: pagination-4.4.7 - <https://wso2.org/jenkins/job/products/job/product-es/ws/.repository/org/wso2/carbon/org.wso2.carbon.registry.server/4.4.7/org.wso2.carbon.registry.server-4.4.7.jar>
INFO  [org.wso2.carbon.automation.extensions.servers.utils.ServerLogReader] - [2022-08-05 06:57:13,248]  WARN {org.wso2.carbon.server.admin.module.handler.AuthenticationHandler} -  Illegal access attempt at [2022-08-05 06:57:13,0248] from IP address 127.0.0.1 while trying to authenticate access to service ServerAdmin
INFO  [org.apache.commons.httpclient.auth.AuthChallengeProcessor] - basic authentication scheme selected
INFO  [org.wso2.carbon.automation.extensions.servers.utils.ServerLogReader] - [2022-08-05 06:57:13,263]  INFO {org.wso2.carbon.core.services.util.CarbonAuthenticationUtil} -  'admin at carbon.super [-1234]' logged in at [2022-08-05 06:57:13,263+0000]
INFO  [org.wso2.carbon.automation.extensions.servers.utils.ServerLogReader] - [2022-08-05 06:57:14,266]  INFO {org.wso2.carbon.core.init.CarbonServerManager} -  Shutting down WSO2 Enterprise Store...
INFO  [org.wso2.carbon.automation.extensions.servers.utils.ServerLogReader] - [2022-08-05 06:57:14,267]  INFO {org.wso2.carbon.core.init.CarbonServerManager} -  Shutting down OSGi framework...
INFO  [org.wso2.carbon.automation.extensions.servers.utils.ServerLogReader] - [2022-08-05 06:57:14,314]  INFO {org.wso2.carbon.core.init.CarbonServerManager} -  Stopping CarbonServerManager...
INFO  [org.wso2.carbon.automation.extensions.servers.utils.ServerLogReader] - [2022-08-05 06:57:14,379] ERROR {org.apache.catalina.loader.WebappClassLoaderBase} -  The web application [/shindig] appears to have started a thread named [com.google.inject.internal.util.$Finalizer] but has failed to stop it. This is very likely to create a memory leak.
INFO  [org.wso2.carbon.automation.extensions.servers.utils.ServerLogReader] - [2022-08-05 06:57:14,393]  INFO {org.wso2.carbon.webapp.mgt.WebApplication} -  Unloaded webapp: StandardEngine[Catalina].StandardHost[localhost].StandardContext[/shindig]
INFO  [org.wso2.carbon.automation.extensions.servers.utils.ServerLogReader] - [2022-08-05 06:57:14,407]  INFO {org.wso2.carbon.webapp.mgt.WebApplication} -  Unloaded webapp: StandardEngine[Catalina].StandardHost[localhost].StandardContext[/sso]
INFO  [org.wso2.carbon.automation.extensions.servers.utils.ServerLogReader] - [2022-08-05 06:57:14,421]  INFO {org.wso2.carbon.webapp.mgt.WebApplication} -  Unloaded webapp: StandardEngine[Catalina].StandardHost[localhost].StandardContext[/publisher]
INFO  [org.wso2.carbon.automation.extensions.servers.utils.ServerLogReader] - [2022-08-05 06:57:14,427]  INFO {org.wso2.carbon.webapp.mgt.WebApplication} -  Unloaded webapp: StandardEngine[Catalina].StandardHost[localhost].StandardContext[/store-admin]
INFO  [org.wso2.carbon.automation.extensions.servers.utils.ServerLogReader] - [2022-08-05 06:57:14,435]  INFO {org.wso2.carbon.webapp.mgt.WebApplication} -  Unloaded webapp: StandardEngine[Catalina].StandardHost[localhost].StandardContext[/store]
INFO  [org.wso2.carbon.automation.extensions.servers.utils.ServerLogReader] - [2022-08-05 06:57:16,590]  INFO {org.wso2.carbon.tomcat.ext.internal.CarbonTomcatServiceComponent} -  Stopping the carbon web-app registered under : /
INFO  [org.wso2.carbon.automation.extensions.servers.utils.ServerLogReader] - [2022-08-05 06:57:16,594]  INFO {org.wso2.carbon.metrics.impl.reporter.AbstractReporter} -  Stopped JDBC reporter for Metrics
INFO  [org.wso2.carbon.automation.extensions.servers.utils.ServerLogReader] - [2022-08-05 06:57:16,595]  INFO {org.wso2.carbon.metrics.impl.reporter.AbstractReporter} -  Stopped JMX reporter for Metrics
INFO  [org.wso2.carbon.automation.extensions.servers.utils.ServerLogReader] - [2022-08-05 06:57:16,784]  INFO {org.wso2.jaggery.scxml.Activator} -  Stopping org.wso2.jaggery.scxml with RealmService disabled
INFO  [org.wso2.carbon.automation.extensions.servers.utils.ServerLogReader] - [2022-08-05 06:57:16,945]  INFO {org.wso2.carbon.core.init.CarbonServerManager} -  Shutdown complete
INFO  [org.wso2.carbon.automation.extensions.servers.utils.ServerLogReader] - [2022-08-05 06:57:16,945]  INFO {org.wso2.carbon.core.init.CarbonServerManager} -  Halting JVM
INFO  [org.wso2.carbon.automation.extensions.servers.carbonserver.CarbonServerManager] - Server stopped successfully...
Tests run: 8, Failures: 0, Errors: 0, Skipped: 0, Time elapsed: 97.639 sec

Results :

Tests run: 8, Failures: 0, Errors: 0, Skipped: 0

[JENKINS] Recording test results
[INFO] 
[INFO] --- maven-jar-plugin:2.5:jar (default-jar) @ org.wso2.es.integration.test ---
[INFO] Building jar: <https://wso2.org/jenkins/job/products/job/product-es/ws/modules/integration/tests-integration/tests/target/org.wso2.es.integration.test-2.1.1-SNAPSHOT.jar>
[INFO] 
[INFO] --- maven-jar-plugin:2.5:test-jar (default) @ org.wso2.es.integration.test ---
[INFO] Building jar: <https://wso2.org/jenkins/job/products/job/product-es/ws/modules/integration/tests-integration/tests/target/org.wso2.es.integration.test-2.1.1-SNAPSHOT-tests.jar>
[INFO] 
[INFO] --- maven-install-plugin:2.5.2:install (default-install) @ org.wso2.es.integration.test ---
[INFO] Installing <https://wso2.org/jenkins/job/products/job/product-es/ws/modules/integration/tests-integration/tests/target/org.wso2.es.integration.test-2.1.1-SNAPSHOT.jar> to <https://wso2.org/jenkins/job/products/job/product-es/ws/.repository/org/wso2/es/org.wso2.es.integration.test/2.1.1-SNAPSHOT/org.wso2.es.integration.test-2.1.1-SNAPSHOT.jar>
[INFO] Installing <https://wso2.org/jenkins/job/products/job/product-es/ws/modules/integration/tests-integration/tests/pom.xml> to <https://wso2.org/jenkins/job/products/job/product-es/ws/.repository/org/wso2/es/org.wso2.es.integration.test/2.1.1-SNAPSHOT/org.wso2.es.integration.test-2.1.1-SNAPSHOT.pom>
[INFO] Installing <https://wso2.org/jenkins/job/products/job/product-es/ws/modules/integration/tests-integration/tests/target/org.wso2.es.integration.test-2.1.1-SNAPSHOT-tests.jar> to <https://wso2.org/jenkins/job/products/job/product-es/ws/.repository/org/wso2/es/org.wso2.es.integration.test/2.1.1-SNAPSHOT/org.wso2.es.integration.test-2.1.1-SNAPSHOT-tests.jar>
[INFO] 
[INFO] -------------------< org.wso2.es:es-platform-tests >--------------------
[INFO] Building es-platform-tests 2.1.1-SNAPSHOT                        [14/14]
[INFO] --------------------------------[ pom ]---------------------------------
[INFO] 
[INFO] --- maven-clean-plugin:2.6.1:clean (default-clean) @ es-platform-tests ---
[INFO] 
[INFO] --- maven-remote-resources-plugin:1.5:process (default) @ es-platform-tests ---
[INFO] 
[INFO] --- maven-install-plugin:2.5.2:install (default-install) @ es-platform-tests ---
[INFO] Installing <https://wso2.org/jenkins/job/products/job/product-es/ws/modules/integration/tests-platform/pom.xml> to <https://wso2.org/jenkins/job/products/job/product-es/ws/.repository/org/wso2/es/es-platform-tests/2.1.1-SNAPSHOT/es-platform-tests-2.1.1-SNAPSHOT.pom>
[INFO] ------------------------------------------------------------------------
[INFO] Reactor Summary:
[INFO] 
[INFO] WSO2 Enterprise Store 2.1.1-SNAPSHOT ............... SUCCESS [  2.213 s]
[INFO] WSO2 Enterprise Store - UI styles .................. SUCCESS [  5.172 s]
[INFO] WSO2 Enterprise Store Features ..................... SUCCESS [  0.168 s]
[INFO] WSO2 Enterprise Store Styles Feature ............... SUCCESS [  3.419 s]
[INFO] wso2es-profile-gen ................................. SUCCESS [24:19 min]
[INFO] WSO2 Enterprise Store - Distribution ............... SUCCESS [ 44.285 s]
[INFO] wso2es-integration ................................. SUCCESS [  0.145 s]
[INFO] WSO2 ES Integration Test Common .................... SUCCESS [  0.164 s]
[INFO] admin-clients ...................................... SUCCESS [15:57 min]
[INFO] ES Integration Test UI Pages ....................... SUCCESS [ 50.403 s]
[INFO] integration-test-utils ............................. SUCCESS [ 32.383 s]
[INFO] WSO2 ES Integration Test ........................... SUCCESS [  0.166 s]
[INFO] org.wso2.es.integration.test ....................... SUCCESS [01:55 min]
[INFO] es-platform-tests 2.1.1-SNAPSHOT ................... SUCCESS [  0.162 s]
[INFO] ------------------------------------------------------------------------
[INFO] BUILD SUCCESS
[INFO] ------------------------------------------------------------------------
[INFO] Total time: 44:50 min
[INFO] Finished at: 2022-08-05T06:57:25Z
[INFO] ------------------------------------------------------------------------
Waiting for Jenkins to finish collecting data
[JENKINS] Archiving <https://wso2.org/jenkins/job/products/job/product-es/ws/pom.xml> to org.wso2.es/wso2es-parent/2.1.1-SNAPSHOT/wso2es-parent-2.1.1-SNAPSHOT.pom
[JENKINS] Archiving <https://wso2.org/jenkins/job/products/job/product-es/ws/modules/integration/tests-common/admin-clients/pom.xml> to org.wso2.es/org.wso2.es.integration.common.clients/2.1.1-SNAPSHOT/org.wso2.es.integration.common.clients-2.1.1-SNAPSHOT.pom
[JENKINS] Archiving <https://wso2.org/jenkins/job/products/job/product-es/ws/modules/integration/tests-common/admin-clients/target/org.wso2.es.integration.common.clients-2.1.1-SNAPSHOT.jar> to org.wso2.es/org.wso2.es.integration.common.clients/2.1.1-SNAPSHOT/org.wso2.es.integration.common.clients-2.1.1-SNAPSHOT.jar
[JENKINS] Archiving <https://wso2.org/jenkins/job/products/job/product-es/ws/modules/features/org.wso2.store.styles.feature/target/org.wso2.store.styles.feature-2.1.1-SNAPSHOT.zip> to org.wso2.es/org.wso2.store.styles.feature/2.1.1-SNAPSHOT/org.wso2.store.styles.feature-2.1.1-SNAPSHOT.pom
[JENKINS] Archiving <https://wso2.org/jenkins/job/products/job/product-es/ws/modules/features/org.wso2.store.styles.feature/target/org.wso2.store.styles.feature-2.1.1-SNAPSHOT.zip> to org.wso2.es/org.wso2.store.styles.feature/2.1.1-SNAPSHOT/org.wso2.store.styles.feature-2.1.1-SNAPSHOT.zip
[JENKINS] Archiving <https://wso2.org/jenkins/job/products/job/product-es/ws/modules/integration/tests-integration/pom.xml> to org.wso2.es/es-integration-tests/2.1.1-SNAPSHOT/es-integration-tests-2.1.1-SNAPSHOT.pom
[JENKINS] Archiving <https://wso2.org/jenkins/job/products/job/product-es/ws/modules/integration/pom.xml> to org.wso2.es/wso2es-integration/2.1.1-SNAPSHOT/wso2es-integration-2.1.1-SNAPSHOT.pom
[JENKINS] Archiving <https://wso2.org/jenkins/job/products/job/product-es/ws/modules/integration/tests-integration/tests/pom.xml> to org.wso2.es/org.wso2.es.integration.test/2.1.1-SNAPSHOT/org.wso2.es.integration.test-2.1.1-SNAPSHOT.pom
[JENKINS] Archiving <https://wso2.org/jenkins/job/products/job/product-es/ws/modules/integration/tests-integration/tests/target/org.wso2.es.integration.test-2.1.1-SNAPSHOT.jar> to org.wso2.es/org.wso2.es.integration.test/2.1.1-SNAPSHOT/org.wso2.es.integration.test-2.1.1-SNAPSHOT.jar
[JENKINS] Archiving <https://wso2.org/jenkins/job/products/job/product-es/ws/modules/integration/tests-integration/tests/target/org.wso2.es.integration.test-2.1.1-SNAPSHOT-tests.jar> to org.wso2.es/org.wso2.es.integration.test/2.1.1-SNAPSHOT/org.wso2.es.integration.test-2.1.1-SNAPSHOT-tests.jar
[JENKINS] Archiving <https://wso2.org/jenkins/job/products/job/product-es/ws/modules/distribution/pom.xml> to org.wso2.es/wso2es/2.1.1-SNAPSHOT/wso2es-2.1.1-SNAPSHOT.pom
[JENKINS] Archiving <https://wso2.org/jenkins/job/products/job/product-es/ws/modules/distribution/target/wso2es-2.1.1-SNAPSHOT.zip> to org.wso2.es/wso2es/2.1.1-SNAPSHOT/wso2es-2.1.1-SNAPSHOT.zip
[JENKINS] Archiving <https://wso2.org/jenkins/job/products/job/product-es/ws/modules/integration/tests-common/pom.xml> to org.wso2.es/es-integration-tests-common/2.1.1-SNAPSHOT/es-integration-tests-common-2.1.1-SNAPSHOT.pom
[JENKINS] Archiving <https://wso2.org/jenkins/job/products/job/product-es/ws/modules/integration/tests-common/ui-pages/pom.xml> to org.wso2.es/ui-pages/2.1.1-SNAPSHOT/ui-pages-2.1.1-SNAPSHOT.pom
[JENKINS] Archiving <https://wso2.org/jenkins/job/products/job/product-es/ws/modules/integration/tests-common/ui-pages/target/ui-pages-2.1.1-SNAPSHOT.jar> to org.wso2.es/ui-pages/2.1.1-SNAPSHOT/ui-pages-2.1.1-SNAPSHOT.jar
[JENKINS] Archiving <https://wso2.org/jenkins/job/products/job/product-es/ws/modules/features/pom.xml> to org.wso2.es/wso2es-features/2.1.1-SNAPSHOT/wso2es-features-2.1.1-SNAPSHOT.pom
[JENKINS] Archiving <https://wso2.org/jenkins/job/products/job/product-es/ws/modules/integration/tests-platform/pom.xml> to org.wso2.es/es-platform-tests/2.1.1-SNAPSHOT/es-platform-tests-2.1.1-SNAPSHOT.pom
[JENKINS] Archiving <https://wso2.org/jenkins/job/products/job/product-es/ws/modules/components/store-admin/pom.xml> to org.wso2.es/org.wso2.store.admin.styles/2.1.1-SNAPSHOT/org.wso2.store.admin.styles-2.1.1-SNAPSHOT.pom
[JENKINS] Archiving <https://wso2.org/jenkins/job/products/job/product-es/ws/modules/components/store-admin/target/org.wso2.store.admin.styles-2.1.1-SNAPSHOT.jar> to org.wso2.es/org.wso2.store.admin.styles/2.1.1-SNAPSHOT/org.wso2.store.admin.styles-2.1.1-SNAPSHOT.jar
[JENKINS] Archiving <https://wso2.org/jenkins/job/products/job/product-es/ws/modules/integration/tests-common/integration-test-utils/pom.xml> to org.wso2.es/org.wso2.es.integration.common.utils/2.1.1-SNAPSHOT/org.wso2.es.integration.common.utils-2.1.1-SNAPSHOT.pom
[JENKINS] Archiving <https://wso2.org/jenkins/job/products/job/product-es/ws/modules/integration/tests-common/integration-test-utils/target/org.wso2.es.integration.common.utils-2.1.1-SNAPSHOT.jar> to org.wso2.es/org.wso2.es.integration.common.utils/2.1.1-SNAPSHOT/org.wso2.es.integration.common.utils-2.1.1-SNAPSHOT.jar
[JENKINS] Archiving <https://wso2.org/jenkins/job/products/job/product-es/ws/modules/p2-profile-gen/pom.xml> to org.wso2.es/wso2es-profile-gen/2.1.1-SNAPSHOT/wso2es-profile-gen-2.1.1-SNAPSHOT.pom
executing script 'Script - Kill Carbon Servers'
channel stopped
[product-es] $ /bin/bash /tmp/build_step_template8662118083862635565.sh
Running port and java processes validation has become successful.
Xvfb stopping
[JaCoCo plugin] Collecting JaCoCo coverage data...
[JaCoCo plugin] **/**.exec;**/classes;**/java; locations are configured
[JaCoCo plugin] Number of found exec files for pattern **/**.exec: 0
[JaCoCo plugin] Saving matched execfiles:  
[JaCoCo plugin] Saving matched class directories for class-pattern: **/classes: 
[JaCoCo plugin]  - <https://wso2.org/jenkins/job/products/job/product-es/ws/modules/components/store-admin/target/classes> 0 files
[JaCoCo plugin]  - <https://wso2.org/jenkins/job/products/job/product-es/ws/modules/distribution/target/classes> 0 files
[JaCoCo plugin]  - <https://wso2.org/jenkins/job/products/job/product-es/ws/modules/integration/tests-common/admin-clients/target/classes> 29 files
[JaCoCo plugin]  - <https://wso2.org/jenkins/job/products/job/product-es/ws/modules/integration/tests-common/integration-test-utils/target/classes> 25 files
[JaCoCo plugin]  - <https://wso2.org/jenkins/job/products/job/product-es/ws/modules/integration/tests-common/ui-pages/target/classes> 3 files
[JaCoCo plugin]  - <https://wso2.org/jenkins/job/products/job/product-es/ws/modules/integration/tests-integration/tests/target/carbontmp1659682539886/wso2es-2.1.1-SNAPSHOT/repository/deployment/server/webapps/shindig/WEB-INF/classes> 0 files
[JaCoCo plugin]  - <https://wso2.org/jenkins/job/products/job/product-es/ws/modules/integration/tests-integration/tests/target/classes> 0 files
[JaCoCo plugin] Saving matched source directories for source-pattern: **/java: 
[JaCoCo plugin] Source Inclusions: **/*.java
[JaCoCo plugin] Source Exclusions: 
[JaCoCo plugin] - <https://wso2.org/jenkins/job/products/job/product-es/ws/.repository/net/java> 0 files
[JaCoCo plugin] - <https://wso2.org/jenkins/job/products/job/product-es/ws/modules/distribution/src/resources/es-migration-client/src/main/java> 10 files
[JaCoCo plugin] - <https://wso2.org/jenkins/job/products/job/product-es/ws/modules/integration/tests-common/admin-clients/src/main/java> 29 files
[JaCoCo plugin] - <https://wso2.org/jenkins/job/products/job/product-es/ws/modules/integration/tests-common/integration-test-utils/src/main/java> 25 files
[JaCoCo plugin] - <https://wso2.org/jenkins/job/products/job/product-es/ws/modules/integration/tests-common/ui-pages/src/main/java> 3 files
[JaCoCo plugin] - <https://wso2.org/jenkins/job/products/job/product-es/ws/modules/integration/tests-integration/tests-es/src/test/java> 24 files
[JaCoCo plugin] - <https://wso2.org/jenkins/job/products/job/product-es/ws/modules/integration/tests-integration/tests/src/test/java> 13 files
[JaCoCo plugin] - <https://wso2.org/jenkins/job/products/job/product-es/ws/modules/integration/tests-ui-integration/tests-ui-extension/src/test/java> 13 files
[JaCoCo plugin] - <https://wso2.org/jenkins/job/products/job/product-es/ws/modules/integration/tests-ui-integration/tests-ui/src/test/java> 32 files
[JaCoCo plugin] - <https://wso2.org/jenkins/job/products/job/product-es/ws/modules/integration/tests-ui-integration/ui-test-utils/src/main/java> 4 files
[JaCoCo plugin] Loading inclusions files..
[JaCoCo plugin] inclusions: [**/*.class]
[JaCoCo plugin] exclusions: [ ]
[JaCoCo plugin] Thresholds: JacocoHealthReportThresholds [minClass=70, maxClass=70, minMethod=70, maxMethod=70, minLine=70, maxLine=70, minBranch=70, maxBranch=70, minInstruction=70, maxInstruction=70, minComplexity=70, maxComplexity=70]
[JaCoCo plugin] Publishing the results..
[JaCoCo plugin] Loading packages..
[JaCoCo plugin] Done.
[JaCoCo plugin] Overall coverage: class: 0, method: 0, line: 0, branch: 0, instruction: 0
using settings config with name maven-settings-xml
Replacing all maven server entries not found in credentials list is false
Maven RedeployPublisher use remote ECS_PRODUCTION-39a6e8e1e471bc maven settings from : /tmp/settings2671302267526834640.xml
[INFO] Deployment in https://maven.wso2.org/nexus/content/repositories/snapshots/ (id=wso2.snapshots,uniqueVersion=true)
Deploying the main artifact es-integration-tests-2.1.1-SNAPSHOT.pom
Downloading from wso2.snapshots: https://maven.wso2.org/nexus/content/repositories/snapshots/org/wso2/es/es-integration-tests/2.1.1-SNAPSHOT/maven-metadata.xml
Downloaded from wso2.snapshots: https://maven.wso2.org/nexus/content/repositories/snapshots/org/wso2/es/es-integration-tests/2.1.1-SNAPSHOT/maven-metadata.xml (612 B at 404 B/s)
Uploading to wso2.snapshots: https://maven.wso2.org/nexus/content/repositories/snapshots/org/wso2/es/es-integration-tests/2.1.1-SNAPSHOT/es-integration-tests-2.1.1-20220805.065917-360.pom
Uploaded to wso2.snapshots: https://maven.wso2.org/nexus/content/repositories/snapshots/org/wso2/es/es-integration-tests/2.1.1-SNAPSHOT/es-integration-tests-2.1.1-20220805.065917-360.pom (1.4 kB at 2 B/s)
Downloading from wso2.snapshots: https://maven.wso2.org/nexus/content/repositories/snapshots/org/wso2/es/es-integration-tests/maven-metadata.xml
Downloaded from wso2.snapshots: https://maven.wso2.org/nexus/content/repositories/snapshots/org/wso2/es/es-integration-tests/maven-metadata.xml (391 B at 9 B/s)
Uploading to wso2.snapshots: https://maven.wso2.org/nexus/content/repositories/snapshots/org/wso2/es/es-integration-tests/2.1.1-SNAPSHOT/maven-metadata.xml
Uploading to wso2.snapshots: https://maven.wso2.org/nexus/content/repositories/snapshots/org/wso2/es/es-integration-tests/maven-metadata.xml
ERROR: Failed to deploy metadata: Could not transfer metadata org.wso2.es:es-integration-tests:2.1.1-SNAPSHOT/maven-metadata.xml from/to wso2.snapshots (https://maven.wso2.org/nexus/content/repositories/snapshots/): Failed to transfer file https://maven.wso2.org/nexus/content/repositories/snapshots/org/wso2/es/es-integration-tests/2.1.1-SNAPSHOT/maven-metadata.xml with status code 504
org.apache.maven.artifact.deployer.ArtifactDeploymentException: Failed to deploy metadata: Could not transfer metadata org.wso2.es:es-integration-tests:2.1.1-SNAPSHOT/maven-metadata.xml from/to wso2.snapshots (https://maven.wso2.org/nexus/content/repositories/snapshots/): Failed to transfer file https://maven.wso2.org/nexus/content/repositories/snapshots/org/wso2/es/es-integration-tests/2.1.1-SNAPSHOT/maven-metadata.xml with status code 504
	at org.apache.maven.artifact.deployer.DefaultArtifactDeployer.deploy(DefaultArtifactDeployer.java:146)
	at hudson.maven.reporters.MavenArtifactRecord.deploy(MavenArtifactRecord.java:198)
	at hudson.maven.RedeployPublisher.perform(RedeployPublisher.java:176)
	at hudson.tasks.BuildStepMonitor$1.perform(BuildStepMonitor.java:20)
	at hudson.model.AbstractBuild$AbstractBuildExecution.perform(AbstractBuild.java:741)
	at hudson.model.AbstractBuild$AbstractBuildExecution.performAllBuildSteps(AbstractBuild.java:690)
	at hudson.maven.MavenModuleSetBuild$MavenModuleSetBuildExecution.post2(MavenModuleSetBuild.java:1074)
	at hudson.model.AbstractBuild$AbstractBuildExecution.post(AbstractBuild.java:635)
	at hudson.model.Run.execute(Run.java:1843)
	at hudson.maven.MavenModuleSetBuild.run(MavenModuleSetBuild.java:543)
	at hudson.model.ResourceController.execute(ResourceController.java:97)
	at hudson.model.Executor.run(Executor.java:429)
Caused by: org.eclipse.aether.deployment.DeploymentException: Failed to deploy metadata: Could not transfer metadata org.wso2.es:es-integration-tests:2.1.1-SNAPSHOT/maven-metadata.xml from/to wso2.snapshots (https://maven.wso2.org/nexus/content/repositories/snapshots/): Failed to transfer file https://maven.wso2.org/nexus/content/repositories/snapshots/org/wso2/es/es-integration-tests/2.1.1-SNAPSHOT/maven-metadata.xml with status code 504
	at org.eclipse.aether.internal.impl.DefaultDeployer.deploy(DefaultDeployer.java:326)
	at org.eclipse.aether.internal.impl.DefaultDeployer.deploy(DefaultDeployer.java:223)
	at org.eclipse.aether.internal.impl.DefaultRepositorySystem.deploy(DefaultRepositorySystem.java:384)
	at org.apache.maven.artifact.deployer.DefaultArtifactDeployer.deploy(DefaultArtifactDeployer.java:142)
	... 11 more
Caused by: org.eclipse.aether.transfer.MetadataTransferException: Could not transfer metadata org.wso2.es:es-integration-tests:2.1.1-SNAPSHOT/maven-metadata.xml from/to wso2.snapshots (https://maven.wso2.org/nexus/content/repositories/snapshots/): Failed to transfer file https://maven.wso2.org/nexus/content/repositories/snapshots/org/wso2/es/es-integration-tests/2.1.1-SNAPSHOT/maven-metadata.xml with status code 504
	at org.eclipse.aether.connector.basic.MetadataTransportListener.transferFailed(MetadataTransportListener.java:52)
	at org.eclipse.aether.connector.basic.BasicRepositoryConnector$TaskRunner.run(BasicRepositoryConnector.java:365)
	at org.eclipse.aether.connector.basic.BasicRepositoryConnector.put(BasicRepositoryConnector.java:298)
	at org.eclipse.aether.internal.impl.DefaultDeployer.deploy(DefaultDeployer.java:320)
	... 14 more
Caused by: org.apache.maven.wagon.TransferFailedException: Failed to transfer file https://maven.wso2.org/nexus/content/repositories/snapshots/org/wso2/es/es-integration-tests/2.1.1-SNAPSHOT/maven-metadata.xml with status code 504
	at org.apache.maven.wagon.shared.http.AbstractHttpClientWagon.put(AbstractHttpClientWagon.java:756)
	at org.apache.maven.wagon.shared.http.AbstractHttpClientWagon.put(AbstractHttpClientWagon.java:670)
	at org.apache.maven.wagon.shared.http.AbstractHttpClientWagon.put(AbstractHttpClientWagon.java:652)
	at org.apache.maven.wagon.shared.http.AbstractHttpClientWagon.put(AbstractHttpClientWagon.java:646)
	at org.apache.maven.wagon.shared.http.AbstractHttpClientWagon.put(AbstractHttpClientWagon.java:626)
	at org.eclipse.aether.transport.wagon.WagonTransporter$PutTaskRunner.run(WagonTransporter.java:686)
	at org.eclipse.aether.transport.wagon.WagonTransporter.execute(WagonTransporter.java:435)
	at org.eclipse.aether.transport.wagon.WagonTransporter.put(WagonTransporter.java:418)
	at org.eclipse.aether.connector.basic.BasicRepositoryConnector$PutTaskRunner.runTask(BasicRepositoryConnector.java:512)
	at org.eclipse.aether.connector.basic.BasicRepositoryConnector$TaskRunner.run(BasicRepositoryConnector.java:360)
	... 16 more
[INFO] Deployment failed after 20 min
Build step 'Deploy artifacts to Maven repository' changed build result to FAILURE


More information about the Builder mailing list