[Builder] Build failed in Jenkins: forked-dependencies » WSO2-OWASP-CSRFGuard #1675

cbuilder at wso2.org cbuilder at wso2.org
Wed Aug 17 12:45:33 PDT 2022


See <https://wso2.org/jenkins/job/forked-dependencies/job/WSO2-OWASP-CSRFGuard/1675/display/redirect>

Changes:


------------------------------------------
[...truncated 262.12 KB...]
[ERROR] <https://wso2.org/jenkins/job/forked-dependencies/job/WSO2-OWASP-CSRFGuard/ws/csrfguard/src/main/java/org/owasp/csrfguard/config/overlay/ConfigPropertiesCascadeBase.java>:1057: warning: no description for @param
[ERROR] * @param required
[ERROR] ^
[ERROR] <https://wso2.org/jenkins/job/forked-dependencies/job/WSO2-OWASP-CSRFGuard/ws/csrfguard/src/main/java/org/owasp/csrfguard/config/overlay/ConfigPropertiesCascadeBase.java>:1080: warning: no description for @param
[ERROR] * @param key
[ERROR] ^
[ERROR] <https://wso2.org/jenkins/job/forked-dependencies/job/WSO2-OWASP-CSRFGuard/ws/csrfguard/src/main/java/org/owasp/csrfguard/config/overlay/ConfigPropertiesCascadeBase.java>:1091: warning: no description for @param
[ERROR] * @param key
[ERROR] ^
[ERROR] <https://wso2.org/jenkins/job/forked-dependencies/job/WSO2-OWASP-CSRFGuard/ws/csrfguard/src/main/java/org/owasp/csrfguard/config/overlay/ConfigPropertiesCascadeBase.java>:1102: warning: no description for @param
[ERROR] * @param key
[ERROR] ^
[ERROR] <https://wso2.org/jenkins/job/forked-dependencies/job/WSO2-OWASP-CSRFGuard/ws/csrfguard/src/main/java/org/owasp/csrfguard/config/overlay/ConfigPropertiesCascadeBase.java>:1103: warning: no description for @param
[ERROR] * @param defaultValue
[ERROR] ^
[ERROR] <https://wso2.org/jenkins/job/forked-dependencies/job/WSO2-OWASP-CSRFGuard/ws/csrfguard/src/main/java/org/owasp/csrfguard/config/overlay/ConfigPropertiesCascadeBase.java>:1114: warning: no description for @param
[ERROR] * @param key
[ERROR] ^
[ERROR] <https://wso2.org/jenkins/job/forked-dependencies/job/WSO2-OWASP-CSRFGuard/ws/csrfguard/src/main/java/org/owasp/csrfguard/config/overlay/ConfigPropertiesCascadeBase.java>:1125: warning: no description for @param
[ERROR] * @param resourceName
[ERROR] ^
[ERROR] <https://wso2.org/jenkins/job/forked-dependencies/job/WSO2-OWASP-CSRFGuard/ws/csrfguard/src/main/java/org/owasp/csrfguard/config/overlay/ConfigPropertiesCascadeBase.java>:1126: warning: no description for @param
[ERROR] * @param exceptionIfNotExist
[ERROR] ^
[ERROR] <https://wso2.org/jenkins/job/forked-dependencies/job/WSO2-OWASP-CSRFGuard/ws/csrfguard/src/main/java/org/owasp/csrfguard/config/overlay/ConfigPropertiesCascadeBase.java>:1171: warning: no description for @param
[ERROR] * @param key
[ERROR] ^
[ERROR] <https://wso2.org/jenkins/job/forked-dependencies/job/WSO2-OWASP-CSRFGuard/ws/csrfguard/src/main/java/org/owasp/csrfguard/config/overlay/ConfigPropertiesCascadeBase.java>:1190: warning: no description for @param
[ERROR] * @param key
[ERROR] ^
[ERROR] <https://wso2.org/jenkins/job/forked-dependencies/job/WSO2-OWASP-CSRFGuard/ws/csrfguard/src/main/java/org/owasp/csrfguard/config/overlay/ConfigPropertiesCascadeBase.java>:1191: warning: no description for @param
[ERROR] * @param required
[ERROR] ^
[ERROR] <https://wso2.org/jenkins/job/forked-dependencies/job/WSO2-OWASP-CSRFGuard/ws/csrfguard/src/main/java/org/owasp/csrfguard/config/overlay/ConfigPropertiesCascadeBase.java>:1222: warning: no description for @param
[ERROR] * @param key
[ERROR] ^
[ERROR] <https://wso2.org/jenkins/job/forked-dependencies/job/WSO2-OWASP-CSRFGuard/ws/csrfguard/src/main/java/org/owasp/csrfguard/config/overlay/ConfigPropertiesCascadeBase.java>:1223: warning: no description for @param
[ERROR] * @param classType
[ERROR] ^
[ERROR] <https://wso2.org/jenkins/job/forked-dependencies/job/WSO2-OWASP-CSRFGuard/ws/csrfguard/src/main/java/org/owasp/csrfguard/config/overlay/ConfigPropertiesCascadeBase.java>:1224: warning: no description for @param
[ERROR] * @param required
[ERROR] ^
[ERROR] <https://wso2.org/jenkins/job/forked-dependencies/job/WSO2-OWASP-CSRFGuard/ws/csrfguard/src/main/java/org/owasp/csrfguard/config/overlay/ConfigPropertiesCascadeBase.java>:1267: warning: no description for @param
[ERROR] * @param pattern
[ERROR] ^
[ERROR] <https://wso2.org/jenkins/job/forked-dependencies/job/WSO2-OWASP-CSRFGuard/ws/csrfguard/src/main/java/org/owasp/csrfguard/config/overlay/ConfigPropertiesCascadeBase.java>:610: warning: no description for @param
[ERROR] * @param configPropertiesCascadeBase
[ERROR] ^
[ERROR] <https://wso2.org/jenkins/job/forked-dependencies/job/WSO2-OWASP-CSRFGuard/ws/csrfguard/src/main/java/org/owasp/csrfguard/config/overlay/ConfigPropertiesCascadeBase.java>:627: warning: no description for @param
[ERROR] * @param configFileFullConfig
[ERROR] ^
[ERROR] <https://wso2.org/jenkins/job/forked-dependencies/job/WSO2-OWASP-CSRFGuard/ws/csrfguard/src/main/java/org/owasp/csrfguard/config/overlay/ConfigPropertiesCascadeBase.java>:551: warning: no description for @param
[ERROR] * @param configFileTypeConfig
[ERROR] ^
[ERROR] <https://wso2.org/jenkins/job/forked-dependencies/job/WSO2-OWASP-CSRFGuard/ws/csrfguard/src/main/java/org/owasp/csrfguard/config/overlay/ConfigPropertiesCascadeBase.java>:560: warning: no description for @param
[ERROR] * @param string
[ERROR] ^
[ERROR] <https://wso2.org/jenkins/job/forked-dependencies/job/WSO2-OWASP-CSRFGuard/ws/csrfguard/src/main/java/org/owasp/csrfguard/config/overlay/ConfigPropertiesCascadeCommonUtils.java>:110: warning: no description for @param
[ERROR] * @param args
[ERROR] ^
[ERROR] <https://wso2.org/jenkins/job/forked-dependencies/job/WSO2-OWASP-CSRFGuard/ws/csrfguard/src/main/java/org/owasp/csrfguard/config/overlay/ConfigPropertiesCascadeCommonUtils.java>:111: warning: no description for @param
[ERROR] * @param argBefore
[ERROR] ^
[ERROR] <https://wso2.org/jenkins/job/forked-dependencies/job/WSO2-OWASP-CSRFGuard/ws/csrfguard/src/main/java/org/owasp/csrfguard/config/overlay/ConfigPropertiesCascadeCommonUtils.java>:136: warning: no description for @param
[ERROR] * @param result
[ERROR] ^
[ERROR] <https://wso2.org/jenkins/job/forked-dependencies/job/WSO2-OWASP-CSRFGuard/ws/csrfguard/src/main/java/org/owasp/csrfguard/config/overlay/ConfigPropertiesCascadeCommonUtils.java>:137: warning: no description for @param
[ERROR] * @param separatorIfResultNotEmpty
[ERROR] ^
[ERROR] <https://wso2.org/jenkins/job/forked-dependencies/job/WSO2-OWASP-CSRFGuard/ws/csrfguard/src/main/java/org/owasp/csrfguard/config/overlay/ConfigPropertiesCascadeCommonUtils.java>:138: warning: no description for @param
[ERROR] * @param stringToAppend
[ERROR] ^
[ERROR] <https://wso2.org/jenkins/job/forked-dependencies/job/WSO2-OWASP-CSRFGuard/ws/csrfguard/src/main/java/org/owasp/csrfguard/config/overlay/ConfigPropertiesCascadeCommonUtils.java>:177: error: unknown tag: todo
[ERROR] * @todo need for I18N?
[ERROR] ^
[ERROR] <https://wso2.org/jenkins/job/forked-dependencies/job/WSO2-OWASP-CSRFGuard/ws/csrfguard/src/main/java/org/owasp/csrfguard/config/overlay/ConfigPropertiesCascadeCommonUtils.java>:196: warning: no description for @param
[ERROR] * @param options
[ERROR] ^
[ERROR] <https://wso2.org/jenkins/job/forked-dependencies/job/WSO2-OWASP-CSRFGuard/ws/csrfguard/src/main/java/org/owasp/csrfguard/config/overlay/ConfigPropertiesCascadeCommonUtils.java>:197: warning: no description for @param
[ERROR] * @param option
[ERROR] ^
[ERROR] <https://wso2.org/jenkins/job/forked-dependencies/job/WSO2-OWASP-CSRFGuard/ws/csrfguard/src/main/java/org/owasp/csrfguard/config/overlay/ConfigPropertiesCascadeCommonUtils.java>:206: warning: no description for @param
[ERROR] * @param file
[ERROR] ^
[ERROR] <https://wso2.org/jenkins/job/forked-dependencies/job/WSO2-OWASP-CSRFGuard/ws/csrfguard/src/main/java/org/owasp/csrfguard/config/overlay/ConfigPropertiesCascadeCommonUtils.java>:236: error: bad use of '>'
[ERROR] * get the oracle underscore name e.g. javaNameHere -> JAVA_NAME_HERE
[ERROR] ^
[ERROR] <https://wso2.org/jenkins/job/forked-dependencies/job/WSO2-OWASP-CSRFGuard/ws/csrfguard/src/main/java/org/owasp/csrfguard/config/overlay/ConfigPropertiesCascadeCommonUtils.java>:286: warning: no description for @param
[ERROR] * @param <K>
[ERROR] ^
[ERROR] <https://wso2.org/jenkins/job/forked-dependencies/job/WSO2-OWASP-CSRFGuard/ws/csrfguard/src/main/java/org/owasp/csrfguard/config/overlay/ConfigPropertiesCascadeCommonUtils.java>:287: warning: no description for @param
[ERROR] * @param <V>
[ERROR] ^
[ERROR] <https://wso2.org/jenkins/job/forked-dependencies/job/WSO2-OWASP-CSRFGuard/ws/csrfguard/src/main/java/org/owasp/csrfguard/config/overlay/ConfigPropertiesCascadeCommonUtils.java>:288: warning: no description for @param
[ERROR] * @param first
[ERROR] ^
[ERROR] <https://wso2.org/jenkins/job/forked-dependencies/job/WSO2-OWASP-CSRFGuard/ws/csrfguard/src/main/java/org/owasp/csrfguard/config/overlay/ConfigPropertiesCascadeCommonUtils.java>:289: warning: no description for @param
[ERROR] * @param second
[ERROR] ^
[ERROR] <https://wso2.org/jenkins/job/forked-dependencies/job/WSO2-OWASP-CSRFGuard/ws/csrfguard/src/main/java/org/owasp/csrfguard/config/overlay/ConfigPropertiesCascadeCommonUtils.java>:308: warning: no description for @param
[ERROR] * @param <K>
[ERROR] ^
[ERROR] <https://wso2.org/jenkins/job/forked-dependencies/job/WSO2-OWASP-CSRFGuard/ws/csrfguard/src/main/java/org/owasp/csrfguard/config/overlay/ConfigPropertiesCascadeCommonUtils.java>:309: warning: no description for @param
[ERROR] * @param <V>
[ERROR] ^
[ERROR] <https://wso2.org/jenkins/job/forked-dependencies/job/WSO2-OWASP-CSRFGuard/ws/csrfguard/src/main/java/org/owasp/csrfguard/config/overlay/ConfigPropertiesCascadeCommonUtils.java>:358: warning: no description for @param
[ERROR] * @param millis
[ERROR] ^
[ERROR] <https://wso2.org/jenkins/job/forked-dependencies/job/WSO2-OWASP-CSRFGuard/ws/csrfguard/src/main/java/org/owasp/csrfguard/config/overlay/ConfigPropertiesCascadeCommonUtils.java>:370: warning: no description for @param
[ERROR] * @param t
[ERROR] ^
[ERROR] <https://wso2.org/jenkins/job/forked-dependencies/job/WSO2-OWASP-CSRFGuard/ws/csrfguard/src/main/java/org/owasp/csrfguard/config/overlay/ConfigPropertiesCascadeCommonUtils.java>:371: warning: no description for @param
[ERROR] * @param message
[ERROR] ^
[ERROR] <https://wso2.org/jenkins/job/forked-dependencies/job/WSO2-OWASP-CSRFGuard/ws/csrfguard/src/main/java/org/owasp/csrfguard/config/overlay/ConfigPropertiesCascadeCommonUtils.java>:440: warning: no description for @param
[ERROR] * @param resourceName
[ERROR] ^
[ERROR] <https://wso2.org/jenkins/job/forked-dependencies/job/WSO2-OWASP-CSRFGuard/ws/csrfguard/src/main/java/org/owasp/csrfguard/config/overlay/ConfigPropertiesCascadeCommonUtils.java>:479: warning: no description for @param
[ERROR] * @param <T>
[ERROR] ^
[ERROR] <https://wso2.org/jenkins/job/forked-dependencies/job/WSO2-OWASP-CSRFGuard/ws/csrfguard/src/main/java/org/owasp/csrfguard/config/overlay/ConfigPropertiesCascadeCommonUtils.java>:480: warning: no description for @param
[ERROR] * @param array
[ERROR] ^
[ERROR] <https://wso2.org/jenkins/job/forked-dependencies/job/WSO2-OWASP-CSRFGuard/ws/csrfguard/src/main/java/org/owasp/csrfguard/config/overlay/ConfigPropertiesCascadeCommonUtils.java>:534: warning: no description for @param
[ERROR] * @param name
[ERROR] ^
[ERROR] <https://wso2.org/jenkins/job/forked-dependencies/job/WSO2-OWASP-CSRFGuard/ws/csrfguard/src/main/java/org/owasp/csrfguard/config/overlay/ConfigPropertiesCascadeCommonUtils.java>:567: warning: no description for @param
[ERROR] * @param theClass
[ERROR] ^
[ERROR] <https://wso2.org/jenkins/job/forked-dependencies/job/WSO2-OWASP-CSRFGuard/ws/csrfguard/src/main/java/org/owasp/csrfguard/config/overlay/ConfigPropertiesCascadeCommonUtils.java>:584: warning: no description for @param
[ERROR] * @param theClass
[ERROR] ^
[ERROR] <https://wso2.org/jenkins/job/forked-dependencies/job/WSO2-OWASP-CSRFGuard/ws/csrfguard/src/main/java/org/owasp/csrfguard/config/overlay/ConfigPropertiesCascadeCommonUtils.java>:616: warning: no description for @param
[ERROR] * @param name
[ERROR] ^
[ERROR] <https://wso2.org/jenkins/job/forked-dependencies/job/WSO2-OWASP-CSRFGuard/ws/csrfguard/src/main/java/org/owasp/csrfguard/config/overlay/ConfigPropertiesCascadeCommonUtils.java>:631: warning: no description for @param
[ERROR] * @param string
[ERROR] ^
[ERROR] <https://wso2.org/jenkins/job/forked-dependencies/job/WSO2-OWASP-CSRFGuard/ws/csrfguard/src/main/java/org/owasp/csrfguard/config/overlay/ConfigPropertiesCascadeCommonUtils.java>:632: warning: no description for @param
[ERROR] * @param defaultStringIfBlank
[ERROR] ^
[ERROR] <https://wso2.org/jenkins/job/forked-dependencies/job/WSO2-OWASP-CSRFGuard/ws/csrfguard/src/main/java/org/owasp/csrfguard/config/overlay/ConfigPropertiesCascadeCommonUtils.java>:641: warning: no description for @param
[ERROR] * @param <T>
[ERROR] ^
[ERROR] <https://wso2.org/jenkins/job/forked-dependencies/job/WSO2-OWASP-CSRFGuard/ws/csrfguard/src/main/java/org/owasp/csrfguard/config/overlay/ConfigPropertiesCascadeCommonUtils.java>:652: warning: no description for @param
[ERROR] * @param <T>
[ERROR] ^
[ERROR] <https://wso2.org/jenkins/job/forked-dependencies/job/WSO2-OWASP-CSRFGuard/ws/csrfguard/src/main/java/org/owasp/csrfguard/config/overlay/ConfigPropertiesCascadeCommonUtils.java>:727: warning: no description for @param
[ERROR] * @param set
[ERROR] ^
[ERROR] <https://wso2.org/jenkins/job/forked-dependencies/job/WSO2-OWASP-CSRFGuard/ws/csrfguard/src/main/java/org/owasp/csrfguard/config/overlay/ConfigPropertiesCascadeCommonUtils.java>:751: warning: no description for @param
[ERROR] * @param map
[ERROR] ^
[ERROR] <https://wso2.org/jenkins/job/forked-dependencies/job/WSO2-OWASP-CSRFGuard/ws/csrfguard/src/main/java/org/owasp/csrfguard/config/overlay/ConfigPropertiesCascadeCommonUtils.java>:762: warning: no description for @param
[ERROR] * @param map
[ERROR] ^
[ERROR] <https://wso2.org/jenkins/job/forked-dependencies/job/WSO2-OWASP-CSRFGuard/ws/csrfguard/src/main/java/org/owasp/csrfguard/config/overlay/ConfigPropertiesCascadeCommonUtils.java>:787: warning: no description for @param
[ERROR] * @param object
[ERROR] ^
[ERROR] <https://wso2.org/jenkins/job/forked-dependencies/job/WSO2-OWASP-CSRFGuard/ws/csrfguard/src/main/java/org/owasp/csrfguard/config/overlay/ConfigPropertiesCascadeCommonUtils.java>:799: warning: no description for @param
[ERROR] * @param object
[ERROR] ^
[ERROR] <https://wso2.org/jenkins/job/forked-dependencies/job/WSO2-OWASP-CSRFGuard/ws/csrfguard/src/main/java/org/owasp/csrfguard/config/overlay/ConfigPropertiesCascadeCommonUtils.java>:816: warning: no description for @param
[ERROR] * @param batchSize
[ERROR] ^
[ERROR] <https://wso2.org/jenkins/job/forked-dependencies/job/WSO2-OWASP-CSRFGuard/ws/csrfguard/src/main/java/org/owasp/csrfguard/config/overlay/ConfigPropertiesCascadeCommonUtils.java>:827: warning: no description for @param
[ERROR] * @param collection
[ERROR] ^
[ERROR] <https://wso2.org/jenkins/job/forked-dependencies/job/WSO2-OWASP-CSRFGuard/ws/csrfguard/src/main/java/org/owasp/csrfguard/config/overlay/ConfigPropertiesCascadeCommonUtils.java>:828: warning: no description for @param
[ERROR] * @param batchSize
[ERROR] ^
[ERROR] <https://wso2.org/jenkins/job/forked-dependencies/job/WSO2-OWASP-CSRFGuard/ws/csrfguard/src/main/java/org/owasp/csrfguard/config/overlay/ConfigPropertiesCascadeCommonUtils.java>:842: warning: no description for @param
[ERROR] * @param collection
[ERROR] ^
[ERROR] <https://wso2.org/jenkins/job/forked-dependencies/job/WSO2-OWASP-CSRFGuard/ws/csrfguard/src/main/java/org/owasp/csrfguard/config/overlay/ConfigPropertiesCascadeCommonUtils.java>:843: warning: no description for @param
[ERROR] * @param batchSize
[ERROR] ^
[ERROR] <https://wso2.org/jenkins/job/forked-dependencies/job/WSO2-OWASP-CSRFGuard/ws/csrfguard/src/main/java/org/owasp/csrfguard/config/overlay/ConfigPropertiesCascadeCommonUtils.java>:844: warning: no description for @param
[ERROR] * @param batchIndex
[ERROR] ^
[ERROR] <https://wso2.org/jenkins/job/forked-dependencies/job/WSO2-OWASP-CSRFGuard/ws/csrfguard/src/main/java/org/owasp/csrfguard/config/overlay/ConfigPropertiesCascadeCommonUtils.java>:948: warning: no description for @param
[ERROR] * @param treatAdjacentSeparatorsAsOne
[ERROR] ^
[ERROR] <https://wso2.org/jenkins/job/forked-dependencies/job/WSO2-OWASP-CSRFGuard/ws/csrfguard/src/main/java/org/owasp/csrfguard/config/overlay/ConfigPropertiesCascadeCommonUtils.java>:1001: warning: no description for @param
[ERROR] * @param <T>
[ERROR] ^
[ERROR] <https://wso2.org/jenkins/job/forked-dependencies/job/WSO2-OWASP-CSRFGuard/ws/csrfguard/src/main/java/org/owasp/csrfguard/config/overlay/ConfigPropertiesCascadeCommonUtils.java>:1002: warning: no description for @param
[ERROR] * @param list
[ERROR] ^
[ERROR] <https://wso2.org/jenkins/job/forked-dependencies/job/WSO2-OWASP-CSRFGuard/ws/csrfguard/src/main/java/org/owasp/csrfguard/config/overlay/ConfigPropertiesCascadeCommonUtils.java>:1011: warning: no description for @param
[ERROR] * @param <T>
[ERROR] ^
[ERROR] <https://wso2.org/jenkins/job/forked-dependencies/job/WSO2-OWASP-CSRFGuard/ws/csrfguard/src/main/java/org/owasp/csrfguard/config/overlay/ConfigPropertiesCascadeCommonUtils.java>:1012: warning: no description for @param
[ERROR] * @param set
[ERROR] ^
[ERROR] <https://wso2.org/jenkins/job/forked-dependencies/job/WSO2-OWASP-CSRFGuard/ws/csrfguard/src/main/java/org/owasp/csrfguard/config/overlay/ConfigPropertiesCascadeCommonUtils.java>:1037: warning: no description for @param
[ERROR] * @param objects
[ERROR] ^
[ERROR] <https://wso2.org/jenkins/job/forked-dependencies/job/WSO2-OWASP-CSRFGuard/ws/csrfguard/src/main/java/org/owasp/csrfguard/config/overlay/ConfigPropertiesCascadeCommonUtils.java>:1058: warning: no description for @param
[ERROR] * @param classes
[ERROR] ^
[ERROR] <https://wso2.org/jenkins/job/forked-dependencies/job/WSO2-OWASP-CSRFGuard/ws/csrfguard/src/main/java/org/owasp/csrfguard/config/overlay/ConfigPropertiesCascadeCommonUtils.java>:1071: warning: no description for @param
[ERROR] * @param objects
[ERROR] ^
[ERROR] <https://wso2.org/jenkins/job/forked-dependencies/job/WSO2-OWASP-CSRFGuard/ws/csrfguard/src/main/java/org/owasp/csrfguard/config/overlay/ConfigPropertiesCascadeCommonUtils.java>:1144: warning: no description for @param
[ERROR] * @param isTrue
[ERROR] ^
[ERROR] <https://wso2.org/jenkins/job/forked-dependencies/job/WSO2-OWASP-CSRFGuard/ws/csrfguard/src/main/java/org/owasp/csrfguard/config/overlay/ConfigPropertiesCascadeCommonUtils.java>:1145: warning: no description for @param
[ERROR] * @param reason
[ERROR] ^
[ERROR] <https://wso2.org/jenkins/job/forked-dependencies/job/WSO2-OWASP-CSRFGuard/ws/csrfguard/src/main/java/org/owasp/csrfguard/config/overlay/ConfigPropertiesCascadeCommonUtils.java>:1332: warning: no description for @param
[ERROR] * @param collection
[ERROR] ^
[ERROR] <https://wso2.org/jenkins/job/forked-dependencies/job/WSO2-OWASP-CSRFGuard/ws/csrfguard/src/main/java/org/owasp/csrfguard/config/overlay/ConfigPropertiesCascadeCommonUtils.java>:5915: error: unexpected end tag: </p>
[ERROR] * </p>
[ERROR] ^
[ERROR] <https://wso2.org/jenkins/job/forked-dependencies/job/WSO2-OWASP-CSRFGuard/ws/csrfguard/src/main/java/org/owasp/csrfguard/config/overlay/ConfigPropertiesCascadeCommonUtils.java>:6768: error: unexpected end tag: </p>
[ERROR] * A <code>null</code> input String returns <code>null</code>.</p>
[ERROR] ^
[ERROR] <https://wso2.org/jenkins/job/forked-dependencies/job/WSO2-OWASP-CSRFGuard/ws/csrfguard/src/main/java/org/owasp/csrfguard/config/overlay/ConfigPropertiesCascadeCommonUtils.java>:8122: error: end tag missing: </code>
[ERROR] * <p>The String is padded to the size of <code>size<code>.</p>
[ERROR] ^
[ERROR] <https://wso2.org/jenkins/job/forked-dependencies/job/WSO2-OWASP-CSRFGuard/ws/csrfguard/src/main/java/org/owasp/csrfguard/config/overlay/ConfigPropertiesCascadeCommonUtils.java>:8122: error: end tag missing: </code>
[ERROR] * <p>The String is padded to the size of <code>size<code>.</p>
[ERROR] ^
[ERROR] <https://wso2.org/jenkins/job/forked-dependencies/job/WSO2-OWASP-CSRFGuard/ws/csrfguard/src/main/java/org/owasp/csrfguard/config/overlay/ExpirableCache.java>:45: error: self-closing element not allowed
[ERROR] * <p />
[ERROR] ^
[ERROR] <https://wso2.org/jenkins/job/forked-dependencies/job/WSO2-OWASP-CSRFGuard/ws/csrfguard/src/main/java/org/owasp/csrfguard/util/CsrfGuardUtils.java>:1019: error: unexpected end tag: </p>
[ERROR] * </p>
[ERROR] ^
[ERROR] <https://wso2.org/jenkins/job/forked-dependencies/job/WSO2-OWASP-CSRFGuard/ws/csrfguard/src/main/java/org/owasp/csrfguard/util/CsrfGuardUtils.java>:1216: error: reference not found
[ERROR] * {@link org.apache.commons.lang.exception.NestableException NestableException}.</p>
[ERROR] ^
[ERROR] 
[ERROR] Command line was: /build/software/java/jdk1.8.0_171/jre/../bin/javadoc @options @packages
[ERROR] 
[ERROR] Refer to the generated Javadoc files in '<https://wso2.org/jenkins/job/forked-dependencies/job/WSO2-OWASP-CSRFGuard/ws/csrfguard/target/apidocs'> dir.
[ERROR] -> [Help 1]
[ERROR] 
[ERROR] To see the full stack trace of the errors, re-run Maven with the -e switch.
[ERROR] Re-run Maven using the -X switch to enable full debug logging.
[ERROR] 
[ERROR] For more information about the errors and possible solutions, please read the following articles:
[ERROR] [Help 1] http://cwiki.apache.org/confluence/display/MAVEN/MojoExecutionException
[JENKINS] Archiving <https://wso2.org/jenkins/job/forked-dependencies/job/WSO2-OWASP-CSRFGuard/ws/csrfguard/pom.xml> to org.wso2.org.owasp/csrfguard/3.1.0-wso2v2-SNAPSHOT/csrfguard-3.1.0-wso2v2-SNAPSHOT.pom
[JENKINS] Archiving <https://wso2.org/jenkins/job/forked-dependencies/job/WSO2-OWASP-CSRFGuard/ws/csrfguard/target/csrfguard-3.1.0-wso2v2-SNAPSHOT.jar> to org.wso2.org.owasp/csrfguard/3.1.0-wso2v2-SNAPSHOT/csrfguard-3.1.0-wso2v2-SNAPSHOT.jar
Sending e-mails to: builder at wso2.org
channel stopped


More information about the Builder mailing list