[Builder] Build failed in Jenkins: products » product-is #4124

cbuilder at wso2.org cbuilder at wso2.org
Fri Jul 1 12:36:15 PDT 2022


See <https://wso2.org/jenkins/job/products/job/product-is/4124/display/redirect>

Changes:


------------------------------------------
[...truncated 15.33 MB...]
[INFO] [INFO] 
[INFO] [INFO] 
[INFO] [ERROR] Tests run: 1871, Failures: 1, Errors: 0, Skipped: 6
[INFO] [INFO] 
[INFO] [INFO] ------------------------------------------------------------------------
[INFO] [INFO] Reactor Summary:
[INFO] [INFO] 
[INFO] [INFO] WSO2 Identity Server 6.0.0-alpha2 .................. SUCCESS [ 11.756 s]
[INFO] [INFO] WSO2 Identity Server Styles Parent ................. SUCCESS [  0.253 s]
[INFO] [INFO] Identity Server: UI styles ......................... SUCCESS [ 12.032 s]
[INFO] [INFO] WSO2 IS - Features Aggregator Module ............... SUCCESS [  0.043 s]
[INFO] [INFO] WSO2 IS - Style Features ........................... SUCCESS [  2.107 s]
[INFO] [INFO] WSO2 IS - Utils Features ........................... SUCCESS [  1.191 s]
[INFO] [INFO] WSO2 Carbon - Identity UI Feature .................. SUCCESS [  2.694 s]
[INFO] [INFO] WSO2 IS - IS Profile Generation .................... SUCCESS [01:26 min]
[INFO] [INFO] CallHome ........................................... SUCCESS [  0.180 s]
[INFO] [INFO] Identity Server : Connector ........................ SUCCESS [  2.556 s]
[INFO] [INFO] WSO2 Identity Server - Rest API .................... SUCCESS [  0.035 s]
[INFO] [INFO] WSO2 Identity Server - All Rest API ................ SUCCESS [ 41.659 s]
[INFO] [INFO] Identity Server : identity-authenticators .......... SUCCESS [  0.237 s]
[INFO] [INFO] Identity Server : Social-authenticators ............ SUCCESS [  0.263 s]
[INFO] [INFO] Identity Server : Provisioning Connectors .......... SUCCESS [  0.373 s]
[INFO] [INFO] Identity Server : identity-local-authenticators .... SUCCESS [  0.701 s]
[INFO] [INFO] Identity Server : oauth2-grant-types ............... SUCCESS [  0.165 s]
[INFO] [INFO] Identity Server .................................... SUCCESS [ 26.084 s]
[INFO] [INFO] WSO2 Identity Integration Test Utils ............... SUCCESS [  0.029 s]
[INFO] [INFO] org.wso2.carbon.identity.test.integration.service .. SUCCESS [  5.339 s]
[INFO] [INFO] org.wso2.carbon.identity.test.integration.service.stubs SUCCESS [ 10.236 s]
[INFO] [INFO] Identity Server Integration Tests .................. SUCCESS [ 10.791 s]
[INFO] [INFO] WSO2 IS - Integration Test Admin Clients Module .... SUCCESS [ 17.884 s]
[INFO] [INFO] WSO2 IS - Integration UI Pages Module .............. SUCCESS [  3.848 s]
[INFO] [INFO] WSO2 IS - Integration Test Utils Module ............ SUCCESS [ 11.918 s]
[INFO] [INFO] Custom Attribute Finder ............................ SUCCESS [  6.943 s]
[INFO] [INFO] WSO2 Identity Integration Test Common .............. SUCCESS [  0.813 s]
[INFO] [INFO] Identity Test Back-end Module ...................... FAILURE [53:53 min]
[INFO] [INFO] org.wso2.identity.integration.test 6.0.0-alpha2 .... SKIPPED
[INFO] [INFO] ------------------------------------------------------------------------
[INFO] [INFO] BUILD FAILURE
[INFO] [INFO] ------------------------------------------------------------------------
[INFO] [INFO] Total time: 58:12 min
[INFO] [INFO] Finished at: 2022-07-01T19:34:37Z
[INFO] [INFO] ------------------------------------------------------------------------
[INFO] [ERROR] Failed to execute goal org.apache.maven.plugins:maven-surefire-plugin:2.22.1:test (default-test) on project org.wso2.carbon.identity.integration.backend.test: There are test failures.
[INFO] [ERROR] 
[INFO] [ERROR] Please refer to <https://wso2.org/jenkins/job/products/job/product-is/ws/modules/integration/tests-integration/tests-backend/target/surefire-reports> for the individual test results.
[INFO] [ERROR] Please refer to dump files (if any exist) [date].dump, [date]-jvmRun[N].dump and [date].dumpstream.
[INFO] [ERROR] -> [Help 1]
[INFO] [ERROR] 
[INFO] [ERROR] To see the full stack trace of the errors, re-run Maven with the -e switch.
[INFO] [ERROR] Re-run Maven using the -X switch to enable full debug logging.
[INFO] [ERROR] 
[INFO] [ERROR] For more information about the errors and possible solutions, please read the following articles:
[INFO] [ERROR] [Help 1] http://cwiki.apache.org/confluence/display/MAVEN/MojoFailureException
[INFO] [ERROR] 
[INFO] [ERROR] After correcting the problems, you can resume the build with the command
[INFO] [ERROR]   mvn <goals> -rf :org.wso2.carbon.identity.integration.backend.test
[INFO] ------------------------------------------------------------------------
[INFO] Reactor Summary:
[INFO] 
[INFO] WSO2 Identity Server 6.0.0-alpha2-SNAPSHOT ......... FAILURE [58:18 min]
[INFO] WSO2 Identity Server Styles Parent ................. SKIPPED
[INFO] Identity Server: UI styles ......................... SKIPPED
[INFO] WSO2 IS - Features Aggregator Module ............... SKIPPED
[INFO] WSO2 IS - Style Features ........................... SKIPPED
[INFO] WSO2 IS - Utils Features ........................... SKIPPED
[INFO] WSO2 Carbon - Identity UI Feature .................. SKIPPED
[INFO] WSO2 IS - IS Profile Generation .................... SKIPPED
[INFO] CallHome ........................................... SKIPPED
[INFO] Identity Server : Connector ........................ SKIPPED
[INFO] WSO2 Identity Server - Rest API .................... SKIPPED
[INFO] WSO2 Identity Server - All Rest API ................ SKIPPED
[INFO] Identity Server : identity-authenticators .......... SKIPPED
[INFO] Identity Server : Social-authenticators ............ SKIPPED
[INFO] Identity Server : Provisioning Connectors .......... SKIPPED
[INFO] Identity Server : identity-local-authenticators .... SKIPPED
[INFO] Identity Server : oauth2-grant-types ............... SKIPPED
[INFO] Identity Server .................................... SKIPPED
[INFO] WSO2 Identity Integration Test Utils ............... SKIPPED
[INFO] org.wso2.carbon.identity.test.integration.service .. SKIPPED
[INFO] org.wso2.carbon.identity.test.integration.service.stubs SKIPPED
[INFO] Identity Server Integration Tests .................. SKIPPED
[INFO] WSO2 IS - Integration Test Admin Clients Module .... SKIPPED
[INFO] WSO2 IS - Integration UI Pages Module .............. SKIPPED
[INFO] WSO2 IS - Integration Test Utils Module ............ SKIPPED
[INFO] Custom Attribute Finder ............................ SKIPPED
[INFO] WSO2 Identity Integration Test Common .............. SKIPPED
[INFO] Identity Test Back-end Module ...................... SKIPPED
[INFO] org.wso2.identity.integration.test 6.0.0-alpha2-SNAPSHOT SKIPPED
[INFO] ------------------------------------------------------------------------
[INFO] BUILD FAILURE
[INFO] ------------------------------------------------------------------------
[INFO] Total time: 58:33 min
[INFO] Finished at: 2022-07-01T19:34:47Z
[INFO] ------------------------------------------------------------------------
Waiting for Jenkins to finish collecting data
[ERROR] Failed to execute goal org.apache.maven.plugins:maven-release-plugin:2.5.3:prepare (default-cli) on project identity-server-parent: Maven execution failed, exit code: '1' -> [Help 1]
[ERROR] 
[ERROR] To see the full stack trace of the errors, re-run Maven with the -e switch.
[ERROR] Re-run Maven using the -X switch to enable full debug logging.
[ERROR] 
[ERROR] For more information about the errors and possible solutions, please read the following articles:
[ERROR] [Help 1] http://cwiki.apache.org/confluence/display/MAVEN/MojoExecutionException
[JENKINS] Archiving <https://wso2.org/jenkins/job/products/job/product-is/ws/modules/tests-utils/admin-services/pom.xml> to org.wso2.is/org.wso2.carbon.identity.test.integration.service/6.0.0-alpha2-SNAPSHOT/org.wso2.carbon.identity.test.integration.service-6.0.0-alpha2-SNAPSHOT.pom
[JENKINS] Archiving <https://wso2.org/jenkins/job/products/job/product-is/ws/pom.xml> to org.wso2.is/identity-server-parent/6.0.0-alpha2-SNAPSHOT/identity-server-parent-6.0.0-alpha2-SNAPSHOT.pom
[JENKINS] Archiving <https://wso2.org/jenkins/job/products/job/product-is/ws/modules/features/pom.xml> to org.wso2.is/identity-features/6.0.0-alpha2-SNAPSHOT/identity-features-6.0.0-alpha2-SNAPSHOT.pom
[JENKINS] Archiving <https://wso2.org/jenkins/job/products/job/product-is/ws/modules/p2-profile-gen/pom.xml> to org.wso2.is/identity-profile-gen/6.0.0-alpha2-SNAPSHOT/identity-profile-gen-6.0.0-alpha2-SNAPSHOT.pom
[JENKINS] Archiving <https://wso2.org/jenkins/job/products/job/product-is/ws/modules/integration/tests-common/admin-clients/pom.xml> to org.wso2.is/org.wso2.identity.integration.common.clients/6.0.0-alpha2-SNAPSHOT/org.wso2.identity.integration.common.clients-6.0.0-alpha2-SNAPSHOT.pom
[JENKINS] Archiving <https://wso2.org/jenkins/job/products/job/product-is/ws/modules/styles/product/pom.xml> to org.wso2.is/org.wso2.identity.styles/6.0.0-alpha2-SNAPSHOT/org.wso2.identity.styles-6.0.0-alpha2-SNAPSHOT.pom
[JENKINS] Archiving <https://wso2.org/jenkins/job/products/job/product-is/ws/modules/tests-utils/pom.xml> to org.wso2.is/identity-integration-tests-utils/6.0.0-alpha2-SNAPSHOT/identity-integration-tests-utils-6.0.0-alpha2-SNAPSHOT.pom
[JENKINS] Archiving <https://wso2.org/jenkins/job/products/job/product-is/ws/modules/integration/tests-integration/pom.xml> to org.wso2.is/org.wso2.identity.integration.test/6.0.0-alpha2-SNAPSHOT/org.wso2.identity.integration.test-6.0.0-alpha2-SNAPSHOT.pom
[JENKINS] Archiving <https://wso2.org/jenkins/job/products/job/product-is/ws/modules/api-resources/pom.xml> to org.wso2.is/api-resources/6.0.0-alpha2-SNAPSHOT/api-resources-6.0.0-alpha2-SNAPSHOT.pom
[JENKINS] Archiving <https://wso2.org/jenkins/job/products/job/product-is/ws/modules/integration/tests-common/integration-test-utils/pom.xml> to org.wso2.is/org.wso2.identity.integration.common.utils/6.0.0-alpha2-SNAPSHOT/org.wso2.identity.integration.common.utils-6.0.0-alpha2-SNAPSHOT.pom
[JENKINS] Archiving <https://wso2.org/jenkins/job/products/job/product-is/ws/modules/styles/pom.xml> to org.wso2.is/identity-server-styles-parent/6.0.0-alpha2-SNAPSHOT/identity-server-styles-parent-6.0.0-alpha2-SNAPSHOT.pom
[JENKINS] Archiving <https://wso2.org/jenkins/job/products/job/product-is/ws/modules/integration/pom.xml> to org.wso2.is/identity-integration-tests/6.0.0-alpha2-SNAPSHOT/identity-integration-tests-6.0.0-alpha2-SNAPSHOT.pom
[JENKINS] Archiving <https://wso2.org/jenkins/job/products/job/product-is/ws/modules/features/org.wso2.identity.utils.feature/pom.xml> to org.wso2.is/org.wso2.identity.utils.feature/6.0.0-alpha2-SNAPSHOT/org.wso2.identity.utils.feature-6.0.0-alpha2-SNAPSHOT.pom
[JENKINS] Archiving <https://wso2.org/jenkins/job/products/job/product-is/ws/modules/features/org.wso2.identity.ui.feature/pom.xml> to org.wso2.is/org.wso2.identity.ui.feature/6.0.0-alpha2-SNAPSHOT/org.wso2.identity.ui.feature-6.0.0-alpha2-SNAPSHOT.pom
[JENKINS] Archiving <https://wso2.org/jenkins/job/products/job/product-is/ws/modules/callhome/pom.xml> to org.wso2.is/callhome/6.0.0-alpha2-SNAPSHOT/callhome-6.0.0-alpha2-SNAPSHOT.pom
[JENKINS] Archiving <https://wso2.org/jenkins/job/products/job/product-is/ws/modules/tests-utils/admin-stubs/pom.xml> to org.wso2.is/org.wso2.carbon.identity.test.integration.service.stubs/6.0.0-alpha2-SNAPSHOT/org.wso2.carbon.identity.test.integration.service.stubs-6.0.0-alpha2-SNAPSHOT.pom
[JENKINS] Archiving <https://wso2.org/jenkins/job/products/job/product-is/ws/modules/connectors/pom.xml> to org.wso2.is/wso2is-identity-connector/6.0.0-alpha2-SNAPSHOT/wso2is-identity-connector-6.0.0-alpha2-SNAPSHOT.pom
[JENKINS] Archiving <https://wso2.org/jenkins/job/products/job/product-is/ws/modules/integration/tests-common/ui-pages/pom.xml> to org.wso2.is/org.wso2.identity.integration.ui.pages/6.0.0-alpha2-SNAPSHOT/org.wso2.identity.integration.ui.pages-6.0.0-alpha2-SNAPSHOT.pom
[JENKINS] Archiving <https://wso2.org/jenkins/job/products/job/product-is/ws/modules/provisioning-connectors/pom.xml> to org.wso2.is/wso2is-identity-provisioning-connectors/6.0.0-alpha2-SNAPSHOT/wso2is-identity-provisioning-connectors-6.0.0-alpha2-SNAPSHOT.pom
[JENKINS] Archiving <https://wso2.org/jenkins/job/products/job/product-is/ws/modules/authenticators/pom.xml> to org.wso2.is/wso2is-identity-authenticators/6.0.0-alpha2-SNAPSHOT/wso2is-identity-authenticators-6.0.0-alpha2-SNAPSHOT.pom
[JENKINS] Archiving <https://wso2.org/jenkins/job/products/job/product-is/ws/modules/integration/tests-common/pom.xml> to org.wso2.is/Identity-integration-tests-common/6.0.0-alpha2-SNAPSHOT/Identity-integration-tests-common-6.0.0-alpha2-SNAPSHOT.pom
[JENKINS] Archiving <https://wso2.org/jenkins/job/products/job/product-is/ws/modules/integration/tests-common/extensions/pom.xml> to org.wso2.is/org.wso2.carbon.identity.custom.pip/6.0.0-alpha2-SNAPSHOT/org.wso2.carbon.identity.custom.pip-6.0.0-alpha2-SNAPSHOT.pom
[JENKINS] Archiving <https://wso2.org/jenkins/job/products/job/product-is/ws/modules/api-resources/api-resources-full/pom.xml> to org.wso2.is/api-resources-full/6.0.0-alpha2-SNAPSHOT/api-resources-full-6.0.0-alpha2-SNAPSHOT.pom
[JENKINS] Archiving <https://wso2.org/jenkins/job/products/job/product-is/ws/modules/integration/tests-integration/tests-backend/pom.xml> to org.wso2.is/org.wso2.carbon.identity.integration.backend.test/6.0.0-alpha2-SNAPSHOT/org.wso2.carbon.identity.integration.backend.test-6.0.0-alpha2-SNAPSHOT.pom
[JENKINS] Archiving <https://wso2.org/jenkins/job/products/job/product-is/ws/modules/distribution/pom.xml> to org.wso2.is/wso2is/6.0.0-alpha2-SNAPSHOT/wso2is-6.0.0-alpha2-SNAPSHOT.pom
[JENKINS] Archiving <https://wso2.org/jenkins/job/products/job/product-is/ws/modules/oauth2-grant-types/pom.xml> to org.wso2.is/wso2is-identity-oauth2-grant-types/6.0.0-alpha2-SNAPSHOT/wso2is-identity-oauth2-grant-types-6.0.0-alpha2-SNAPSHOT.pom
[JENKINS] Archiving <https://wso2.org/jenkins/job/products/job/product-is/ws/modules/social-authenticators/pom.xml> to org.wso2.is/wso2is-identity-social-authenticators/6.0.0-alpha2-SNAPSHOT/wso2is-identity-social-authenticators-6.0.0-alpha2-SNAPSHOT.pom
[JENKINS] Archiving <https://wso2.org/jenkins/job/products/job/product-is/ws/modules/features/org.wso2.identity.styles.feature/pom.xml> to org.wso2.is/org.wso2.identity.styles.feature/6.0.0-alpha2-SNAPSHOT/org.wso2.identity.styles.feature-6.0.0-alpha2-SNAPSHOT.pom
[JENKINS] Archiving <https://wso2.org/jenkins/job/products/job/product-is/ws/modules/local-authenticators/pom.xml> to org.wso2.is/wso2is-identity-local-authenticators/6.0.0-alpha2-SNAPSHOT/wso2is-identity-local-authenticators-6.0.0-alpha2-SNAPSHOT.pom
No mail will be sent out, as 'products » product-is » org.wso2.carbon.identity.test.integration.service #4124' does not have a result yet. Please make sure you set a proper result in case of pipeline/build scripts.
Sending e-mails to: builder at wso2.org iam-builder at wso2.com
No mail will be sent out, as 'products » product-is » WSO2 IS - Features Aggregator Module #4124' does not have a result yet. Please make sure you set a proper result in case of pipeline/build scripts.
No mail will be sent out, as 'products » product-is » WSO2 IS - IS Profile Generation #4124' does not have a result yet. Please make sure you set a proper result in case of pipeline/build scripts.
No mail will be sent out, as 'products » product-is » WSO2 IS - Integration Test Admin Clients Module #4124' does not have a result yet. Please make sure you set a proper result in case of pipeline/build scripts.
No mail will be sent out, as 'products » product-is » Identity Server: UI styles #4124' does not have a result yet. Please make sure you set a proper result in case of pipeline/build scripts.
No mail will be sent out, as 'products » product-is » WSO2 Identity Integration Test Utils #4124' does not have a result yet. Please make sure you set a proper result in case of pipeline/build scripts.
No mail will be sent out, as 'products » product-is » org.wso2.identity.integration.test #4124' does not have a result yet. Please make sure you set a proper result in case of pipeline/build scripts.
No mail will be sent out, as 'products » product-is » WSO2 Identity Server - Rest API #4124' does not have a result yet. Please make sure you set a proper result in case of pipeline/build scripts.
No mail will be sent out, as 'products » product-is » WSO2 IS - Integration Test Utils Module #4124' does not have a result yet. Please make sure you set a proper result in case of pipeline/build scripts.
No mail will be sent out, as 'products » product-is » WSO2 Identity Server Styles Parent #4124' does not have a result yet. Please make sure you set a proper result in case of pipeline/build scripts.
No mail will be sent out, as 'products » product-is » Identity Server Integration Tests #4124' does not have a result yet. Please make sure you set a proper result in case of pipeline/build scripts.
No mail will be sent out, as 'products » product-is » WSO2 IS - Utils Features #4124' does not have a result yet. Please make sure you set a proper result in case of pipeline/build scripts.
No mail will be sent out, as 'products » product-is » WSO2 Carbon - Identity UI Feature #4124' does not have a result yet. Please make sure you set a proper result in case of pipeline/build scripts.
No mail will be sent out, as 'products » product-is » CallHome #4124' does not have a result yet. Please make sure you set a proper result in case of pipeline/build scripts.
No mail will be sent out, as 'products » product-is » org.wso2.carbon.identity.test.integration.service.stubs #4124' does not have a result yet. Please make sure you set a proper result in case of pipeline/build scripts.
No mail will be sent out, as 'products » product-is » Identity Server : Connector #4124' does not have a result yet. Please make sure you set a proper result in case of pipeline/build scripts.
No mail will be sent out, as 'products » product-is » WSO2 IS - Integration UI Pages Module #4124' does not have a result yet. Please make sure you set a proper result in case of pipeline/build scripts.
No mail will be sent out, as 'products » product-is » Identity Server : Provisioning Connectors #4124' does not have a result yet. Please make sure you set a proper result in case of pipeline/build scripts.
No mail will be sent out, as 'products » product-is » Identity Server : identity-authenticators #4124' does not have a result yet. Please make sure you set a proper result in case of pipeline/build scripts.
No mail will be sent out, as 'products » product-is » WSO2 Identity Integration Test Common #4124' does not have a result yet. Please make sure you set a proper result in case of pipeline/build scripts.
No mail will be sent out, as 'products » product-is » Custom Attribute Finder #4124' does not have a result yet. Please make sure you set a proper result in case of pipeline/build scripts.
No mail will be sent out, as 'products » product-is » WSO2 Identity Server - All Rest API #4124' does not have a result yet. Please make sure you set a proper result in case of pipeline/build scripts.
No mail will be sent out, as 'products » product-is » Identity Test Back-end Module #4124' does not have a result yet. Please make sure you set a proper result in case of pipeline/build scripts.
No mail will be sent out, as 'products » product-is » Identity Server #4124' does not have a result yet. Please make sure you set a proper result in case of pipeline/build scripts.
No mail will be sent out, as 'products » product-is » Identity Server : oauth2-grant-types #4124' does not have a result yet. Please make sure you set a proper result in case of pipeline/build scripts.
No mail will be sent out, as 'products » product-is » Identity Server : Social-authenticators #4124' does not have a result yet. Please make sure you set a proper result in case of pipeline/build scripts.
No mail will be sent out, as 'products » product-is » WSO2 IS - Style Features #4124' does not have a result yet. Please make sure you set a proper result in case of pipeline/build scripts.
No mail will be sent out, as 'products » product-is » Identity Server : identity-local-authenticators #4124' does not have a result yet. Please make sure you set a proper result in case of pipeline/build scripts.
executing script 'Script - Kill Carbon Servers'
channel stopped
[product-is] $ /bin/bash /tmp/build_step_template4171744402066618911.sh
Running port and java processes validation has become successful.
[product-is] $ /bin/bash /tmp/jenkins2951341828887886448.sh
+ is_release_build=false
++ date +%s -d '2022-07-02 00:05:47 IST'
+ timestamp=1656700547
+ echo 1656700547
1656700547
+ [[ -v MVN_RELEASE_VERSION ]]
+ is_release_build=true
++ find target/checkout/modules/distribution/target/ -maxdepth 1 '!' -name '*src*' -name 'wso2is*.zip' -type f
find: `target/checkout/modules/distribution/target/': No such file or directory
+ distributionPath=
+ echo

++ basename
basename: missing operand
Try 'basename --help' for more information.
+ zipName=
+ zipName=
+ DIST_URL=https://wso2.org/jenkins/job/products/job/product-is/4124//artifact/
+ echo https://wso2.org/jenkins/job/products/job/product-is/4124//artifact/
https://wso2.org/jenkins/job/products/job/product-is/4124//artifact/
+ echo RELEASE_NAME=
+ echo IS_A_RELEASE=true
+ echo 'zip name: '
zip name: 
+ dockerImageTag=
+ echo 'docker image tag: '
docker image tag: 
+ echo DOCKER_IMAGE_TAG=
+ echo DIST_URL=https://wso2.org/jenkins/job/products/job/product-is/4124//artifact/
+ pwd
<https://wso2.org/jenkins/job/products/job/product-is/ws/>
+ ls -al
total 488
drwxr-xr-x 14 root root   4096 Jul  1 19:35 .
drwxr-xr-x  4 root root   4096 Jul  1 18:35 ..
drwxr-xr-x  8 root root   4096 Jul  1 18:36 .git
drwxr-xr-x  5 root root   4096 Jul  1 18:35 .github
-rw-r--r--  1 root root    361 Jul  1 18:35 .gitignore
drwxr-xr-x 78 root root   4096 Jul  1 18:40 .repository
-rw-r--r--  1 root root  11323 Jul  1 18:35 LICENSE
-rw-r--r--  1 root root 108164 Jul  1 18:35 LICENSE.txt
-rw-r--r--  1 root root    376 Jul  1 18:35 NOTICE.txt
-rw-r--r--  1 root root   9303 Jul  1 18:35 README.md
-rw-r--r--  1 root root   8326 Jul  1 18:35 README.txt
-rw-r--r--  1 root root   1010 Jul  1 18:35 SECURITY.md
-rw-r--r--  1 root root    128 Jul  1 19:35 build.properties
drwxr-xr-x  2 root root   4096 Jul  1 18:35 docs
drwxr-xr-x  2 root root   4096 Jul  1 18:35 etc
-rw-r--r--  1 root root    807 Jul  1 18:35 issue_template.md
drwxr-xr-x  4 root root   4096 Jul  1 18:35 jmeter-tests
drwxr-xr-x  2 root root   4096 Jul  1 18:35 legal
drwxr-xr-x 19 root root   4096 Jul  1 18:35 modules
drwxr-xr-x  9 root root   4096 Jul  1 18:35 oidc-conformance-tests
-rw-r--r--  1 root root 115911 Jul  1 18:36 pom.xml
-rw-r--r--  1 root root 115911 Jul  1 18:36 pom.xml.releaseBackup
drwxr-xr-x 16 root root   4096 Jul  1 18:35 product-scenarios
-rw-r--r--  1 root root   8865 Jul  1 18:35 release-guidelines.md
-rw-r--r--  1 root root   8514 Jul  1 18:35 release-notes.html
-rw-r--r--  1 root root   7107 Jul  1 18:36 release.properties
-rw-r--r--  1 root root     11 Jul  1 18:36 repoLastDeleteRecord.txt
drwxr-xr-x  4 root root   4096 Jul  1 18:36 target
drwxr-xr-x  7 root root   4096 Jul  1 18:35 usecases
+ cat build.properties
RELEASE_NAME=
IS_A_RELEASE=true
DOCKER_IMAGE_TAG=
DIST_URL=https://wso2.org/jenkins/job/products/job/product-is/4124//artifact/
using credential github-user-for-maven-releases
 > git rev-parse HEAD^{commit} # timeout=10
using credential github-user-for-maven-releases
 > git rev-parse HEAD^{commit} # timeout=10
------------------------------------------------------------------------

[WSO2 Maven Release] [WSO2 Maven Release] Build Result: FAILURE
[WSO2 Maven Release] Dropping Git Tag: v6.0.0-alpha2. Reason: FAILURE build.

[WSO2 Maven Release] Deleting release tag from remote.
 > git --version # timeout=10
using GIT_ASKPASS to set credentials github user for maven release plugin (CD)
 > git push https://github.com/wso2/product-is.git :refs/tags/v6.0.0-alpha2 # timeout=10
[WSO2 Maven Release] Dropped git tag - v6.0.0-alpha2
FATAL: [M2Release] Could not find nexus stage repository for project.

Archiving artifacts


More information about the Builder mailing list